program: Gaussian 09
title: 000063255
version: EM64L-G09RevD.01
frameworkgroup: C1[X(C15H10F2N2O2)]
method: RPBEPBE
basis: SDD
operation: Freq
keyword: #p
keyword: freq=noraman
keyword: PBEPBE/SDD
title: #p freq=noraman PBEPBE/SDD
converged: YES YES NO NO
title: Mulliken charges:
elementType: F F O O N N C C C C C C C C C C C C C C C H H H H H H H H H H
charge: -0.155731 -0.198565 -0.231854 -0.213412 -0.449230 -0.032352 0.214437 0.361265 0.002557 0.327881 -0.506497 -0.382762 0.313515 -0.334918 -0.041739 -0.396514 -0.358052 -0.234772 -0.229889 -0.230834 0.149317 0.307827 0.246388 0.334444 0.271563 0.269566 0.273602 0.236576 0.234948 0.235703 0.217532
chargesum: 0.00000
title: Mulliken charges with hydrogens summed into heavy atoms:
elementType: F F O O N N C C C C C C C C C C C C C C C
charge: -0.155731 -0.198565 -0.231854 -0.213412 -0.114786 -0.032352 0.214437 0.361265 0.002557 0.327881 -0.198670 -0.136374 0.313515 -0.063355 -0.041739 -0.126948 -0.084450 0.001804 0.005059 0.004868 0.366848
polarizability: 2.36527958e+02 2.14300314e-02 2.52459966e+02 -2.25205228e+01 -1.67260623e+00 9.59995399e+01
1716.lowfreq: -5.9831 -1.3111 -0.0007 -0.0003 0.0005 3.7337 23.9732 46.6097 49.8942
frequency: 23.8770 46.5702 49.8844 58.5273 77.5223 95.4844 109.2718 173.1888 183.5506 219.5269 247.4371 273.3766 289.7910 333.2770 364.2818 382.9856 406.2148 434.1424 450.5809 468.1268 486.1441 514.8216 549.6126 561.2300 607.5459 616.4642 620.8059 653.2792 665.4653 687.2014 704.0541 731.1938 744.3870 766.3731 792.5160 826.3637 829.3206 858.4027 874.9098 901.8151 911.7644 915.1810 945.1815 957.9153 970.9832 987.8351 989.3585 1003.3821 1028.1850 1035.6481 1046.2491 1088.0882 1101.5141 1126.0451 1174.5964 1175.9517 1194.0410 1196.7830 1257.1675 1286.7122 1291.4696 1311.0908 1321.0736 1330.0072 1375.5023 1381.4800 1412.5465 1418.8829 1435.5487 1472.5948 1482.4980 1525.4641 1582.0304 1591.5725 1608.8921 1625.7406 1637.8156 3051.6924 3131.5270 3140.2301 3146.1887 3151.7469 3163.5362 3173.6822 3178.8332 3180.2164 3519.0661
redmass: 9.4931 9.3152 5.6947 6.2344 5.0624 6.9256 8.1132 5.5726 7.5200 8.8536 5.4568 7.9900 8.1571 6.7428 5.8997 6.8851 2.8858 4.1075 6.7987 8.3826 4.7080 6.9041 4.4002 5.8010 7.0312 6.6437 7.5639 2.5522 5.8575 2.8251 1.8215 5.1809 2.6200 2.9952 2.7161 4.5595 1.8295 1.2738 7.8346 1.9364 3.1203 5.4614 1.4535 1.3478 4.3487 1.7696 3.1353 1.3287 2.2145 6.5353 4.4579 1.6982 4.2938 1.6392 2.0432 1.0813 1.1734 2.8000 1.6635 1.4409 1.2772 1.5023 1.4756 2.6852 2.6089 7.3515 5.3857 5.7623 2.3520 2.9819 2.4024 5.5846 5.9993 8.0181 5.9947 7.2038 6.1336 1.0880 1.0852 1.0886 1.0901 1.0933 1.0966 1.1002 1.0937 1.0947 1.0774
irintensity: 2.6566 3.7839 1.2622 3.9221 0.5537 0.4366 1.7615 4.3710 3.4647 0.2100 1.3456 0.7942 5.7298 0.9924 0.7346 1.4762 0.9759 2.1616 6.8910 5.3266 0.9634 0.3094 7.2361 20.7341 6.6925 2.1071 16.2418 25.0001 2.0213 10.4196 59.2359 3.4540 18.1163 50.9462 21.4135 15.8597 68.6656 9.9387 22.4652 7.9255 76.7273 110.3146 6.2552 0.2842 7.5639 5.0920 0.8683 0.9569 7.0865 89.6164 539.7839 28.0732 38.8787 5.9022 138.1200 5.8959 22.2608 131.7270 10.1491 56.3857 66.5805 55.1014 7.6737 133.3916 51.2746 7.3001 33.4879 6.3647 13.6282 15.8276 2.1638 283.5306 6.0782 72.9461 27.8372 17.4705 636.9316 30.1448 0.4989 4.3781 6.5957 22.5433 14.5755 17.0152 0.7290 5.3802 44.5896
temp: 298.150 k
press: 1.00000 atm
elementType: 9 9 8 8 7 7 6 6 6 6 6 6 6 6 6 6 6 6 6 6 6 1 1 1 1 1 1 1 1 1 1
symmnumber: 1
zpe: 578472.4 jmol-1
zpe.correction: 0.220329 hartree
zpe.thermalcorrener: 0.237200 hartree
zpe.thermalcorrenthalpy: 0.238144 hartree
zpe.thermalcorrgfe: 0.173763 hartree
zpe.sumelectzpe: -1035.783151 hartree
zpe.sumelectthermal: -1035.766279 hartree
zpe.sumelectthermalent: -1035.765335 hartree
zpe.sumelectthermalfe: -1035.829716 hartree
dipole: -3.0109 -0.1129 -0.4330
dipole: 3.0439
quadrupole: -158.3476 -98.7240 -117.0992
quadrupole: 21.3703 2.5324 -4.5361
quadrupole: -33.6240 25.9996 7.6244 21.3703 2.5324 -4.5361
hfenergy: -1036.003479 hartree
pointgroup: C01[X(C15H10F2N2O2)]
dipole: 1.1947115 -0.0823702 0.0090557 debye
polarizability: 227.7883662|-0.4805576|252.4418333|-40.7239616|-2.3997556|104.7572644 unknown
InChI: InChI=1S/C15H10F2N2O2/c16-14(17)21-10-6-7-12-11(8-10)13(19-15(20)18-12)9-4-2-1-3-5-9/h1-8,14,18H
charge 0 multiplicity 1
31 atoms
F  5.289215 0.625952 0.074616
F  3.430331 1.654069 -0.75602
O  3.550159 -0.67405 -0.510018
O  -3.747476 -2.719528 1.024828
N  -1.574356 -2.872576 0.20931
N  -2.582929 -0.716058 0.576492
C  -0.186129 -0.897748 0.030942
C  -0.320598 -2.322952 -0.037806
C  -1.421626 -0.128443 0.264334
C  -1.460859 1.36067 0.163673
C  1.109873 -0.321592 -0.105336
C  0.807774 -3.140972 -0.323128
C  2.212523 -1.153489 -0.344267
C  2.069416 -2.55692 -0.48125
C  -2.706483 -2.12273 0.645743
C  -0.762216 2.075246 -0.848671
C  -2.289824 2.079311 1.067597
C  -0.873717 3.479779 -0.935869
C  -2.387063 3.48266 0.987128
C  -1.675462 4.188975 -0.012285
C  3.885359 0.558259 0.066061
H  1.22433 0.761739 -0.029663
H  0.692439 -4.227445 -0.398393
H  -1.70671 -3.88756 0.177107
H  2.956722 -3.161922 -0.687482
H  -0.174383 1.53831 -1.600534
H  -2.856822 1.51543 1.814478
H  -0.342186 4.016577 -1.728793
H  -3.021268 4.025501 1.696127
H  -1.754483 5.279721 -0.07752
H  3.486749 0.718486 1.084799
