program: Gaussian 09
title: 000007467
version: EM64L-G09RevD.01
frameworkgroup: C1[X(C8H7ClO)]
method: RPBEPBE
basis: SDD
operation: Freq
keyword: #p
keyword: freq=noraman
keyword: PBEPBE/SDD
title: #p freq=noraman PBEPBE/SDD
converged: NO YES NO NO
title: Mulliken charges:
elementType: Cl O C C C C C C C C H H H H H H H
charge: -0.039643 -0.222838 0.307911 -0.327420 -0.331677 0.132333 -0.215737 -0.212599 -0.098293 -0.786233 0.247961 0.284335 0.258934 0.261492 0.238892 0.263746 0.238836
chargesum: 0.00000
title: Mulliken charges with hydrogens summed into heavy atoms:
elementType: Cl O C C C C C C C C
charge: -0.039643 -0.222838 0.307911 -0.079460 -0.047342 0.132333 0.043197 0.048894 -0.098293 -0.044759
polarizability: 1.55870882e+02 2.43664727e+00 9.57132592e+01 -4.97759021e-03 4.95273810e-03 4.25362926e+01
1716.lowfreq: 0.0011 0.0023 0.0026 4.6861 8.4239 17.7717 70.3139 85.0990 153.9971
frequency: 70.2308 85.0957 153.9950 166.1358 249.9090 287.0508 298.1751 407.1277 430.7737 461.1413 501.9264 588.8899 601.9381 621.7360 721.1351 743.0823 826.1257 847.7484 947.6364 959.6524 992.3710 998.6640 1028.5429 1067.0062 1076.6131 1111.0965 1183.7050 1271.9519 1294.7517 1367.3351 1377.0169 1398.7261 1447.9012 1463.1244 1473.2989 1564.8269 1590.0948 1607.2552 2985.0440 3068.3482 3127.4526 3148.7484 3152.8552 3171.9533 3175.3393
redmass: 3.9300 8.6280 1.0308 6.0335 6.2124 5.1153 8.8340 2.8871 3.6933 3.3372 7.3811 2.4996 4.3615 7.1398 3.5097 6.0048 1.3371 1.3436 2.2074 1.3473 1.3533 4.0872 1.8229 4.1557 1.9830 1.3359 1.1294 3.8417 1.2553 2.2905 1.8746 3.8301 1.1011 1.0492 2.3534 7.1746 6.6160 7.5263 1.0379 1.0968 1.0991 1.0885 1.0889 1.0961 1.0974
irintensity: 3.9775 1.2793 0.4677 4.6567 0.0482 4.0269 0.0673 0.0329 5.0571 11.7724 25.5331 14.9124 2.6827 0.8430 1.8042 24.1378 35.5659 39.5711 38.9714 0.1626 1.5867 33.5391 1.0342 17.9181 33.9333 12.1833 13.6485 225.8994 1.8940 12.8348 50.2396 29.9158 31.9318 21.6817 11.0125 82.7327 133.9142 50.1302 3.2443 11.9714 15.3523 4.9020 0.3420 5.9029 1.6506
temp: 298.150 k
press: 1.00000 atm
elementType: 17 8 6 6 6 6 6 6 6 6 1 1 1 1 1 1 1
symmnumber: 1
zpe: 329652.1 jmol-1
zpe.correction: 0.125558 hartree
zpe.thermalcorrener: 0.134786 hartree
zpe.thermalcorrenthalpy: 0.135730 hartree
zpe.thermalcorrgfe: 0.090445 hartree
zpe.sumelectzpe: -843.620095 hartree
zpe.sumelectthermal: -843.610867 hartree
zpe.sumelectthermalent: -843.609923 hartree
zpe.sumelectthermalfe: -843.655208 hartree
dipole: -0.2481 -2.6230 -0.0009
dipole: 2.6347
quadrupole: -73.9253 -59.9157 -67.1736
quadrupole: -9.9607 -0.0027 -0.0012
quadrupole: -6.9204 7.0891 -0.1687 -9.9607 -0.0027 -0.0012
hfenergy: -843.7456527 hartree
pointgroup: C01 [X(C8H7Cl1O1)]
dipole: 0.115246 -1.0301278 0.0003646 debye
dipolederiv: -0.9411846 0.0070971 0.0003438 0.0091601 -0.1180734 0.0000023 0.0003979 0.0000026 -0.0603782 -0.9512045 0.1274142 0.000243 0.3608325 -0.7301874 -0.0003605 -0.0002865 0.0002665 -0.3160317 -0.866992 -0.0302654 0.0001472 -0.1003433 -0.1442778 -0.0000072 0.0003647 0.0000447 -0.0152668 0.2394943 0.0822972 -0.000196 -0.1502505 0.0475911 0.0000539 0.0000638 -0.0001025 -0.1280822 0.1525504 -0.1146742 -0.000134 0.1791277 0.0473139 -0.0000486 0.0000111 0.0000292 -0.0943774 1.8108038 0.0614044 -0.0002527 0.0186505 0.9124965 0.0003301 -0.0000479 0.0000068 0.1243035 -0.4810844 -0.1326574 0.0001535 -0.2174153 -0.0285646 0.0000788 0.000164 0.0000657 -0.109798 -0.4221454 0.1675834 0.0000875 0.181759 -0.0224408 -0.0001035 0.0000872 -0.0001024 -0.1106819 1.38583 -0.0143484 -0.0005857 0.0134794 0.2128816 -0.0000363 -0.0006014 -0.0000153 -0.0536082 -0.2204656 -0.1885705 -0.0000778 -0.3274623 -0.3740597 -0.0001672 -0.000442 -0.0004608 0.0501443 0.048201 -0.08672 0.0000673 -0.0857522 -0.0268919 0.0000466 0.0000677 0.0000627 0.1439725 0.0992764 0.0730146 0.0000338 0.0161265 0.0315482 -0.0000052 0.0000444 -0.0000048 0.154948 0.0467201 0.0641985 0.0000296 0.062625 -0.0016069 -0.0000097 0.000007 -0.0000282 0.1669984 0.0410076 -0.0702254 0.0000482 -0.0631407 0.0058006 0.0000489 0.0000283 0.0000629 0.1661598 0.0819916 0.0284403 0.0823543 0.0181254 0.0477897 -0.0728951 0.0506115 -0.0882764 -0.020834 -0.1051016 -0.0023849 -0.0000929 0.066508 0.0930082 0.0000379 -0.0001492 -0.0000035 0.1235964 0.0823029 0.0283967 -0.0821691 0.0179704 0.0476726 0.0730347 -0.0503204 0.0884528 -0.0210645 unknown
polarizability: 155.9366441|-1.4057655|95.6474854|-0.035232|-0.0074936|42.536304 unknown
InChI: InChI=1S/C8H7ClO/c1-6(10)7-2-4-8(9)5-3-7/h2-5H,1H3
charge 0 multiplicity 1
17 atoms
Cl 3.921517 -0.028387 -0.001194
O  -2.802913 1.207003 0.000371
C  -0.711954 0.013832 0.000821
C  -0.001572 -1.216946 0.000602
C  0.022627 1.231968 0.000336
C  -2.215477 0.084843 0.001406
C  1.408841 -1.237227 0.000007
C  1.429768 1.229732 -0.000275
C  2.103352 -0.010721 -0.000408
C  -3.015924 -1.212798 0.000447
H  -0.542243 -2.168955 0.000956
H  -0.538768 2.172183 0.000484
H  1.959097 -2.182511 -0.000135
H  1.995752 2.165705 -0.000647
H  -2.780978 -1.82458 -0.89076
H  -4.089406 -0.971753 -0.000307
H  -2.782319 -1.824888 0.891794
