program: Orca
programVersion: 4.2.1
elementType: Br Cl Cl O N N N C C C C C C C C C C C C C H H H H H H H H H H H H
charge: 0
multiplicity: 1
keywords: wb97x-d3
keywords: def2-TZVPP
keywords: def2/J RIJCOSX GRIDX6 NOFINALGRIDX
keywords: grid4 nofinalgrid
keywords: scfconv7
keywords: smallprint printgap noloewdin
keywords: NOSOSCF
formula: C13H12BrCl2N3O
InChI: InChI=1/C13H12BrCl2N3O/c14-9-4-13(20-5-9,6-19-8-17-7-18-19)11-2-1-10(15)3-12(11)16/h1-3,7-9H,4-6H2
32 atoms
Br -4.11639 0.212877 -0.096214
Cl 0.972966 1.844169 2.07478
Cl 5.288311 1.335236 -1.0063
O  -1.076454 -0.493839 -1.246041
N  0.095528 -2.13056 0.797836
N  -0.394303 -3.159492 0.100626
N  1.745976 -3.538592 0.655205
C  -0.561891 0.096094 -0.072016
C  -1.462804 1.334306 0.193944
C  -2.587329 1.202369 -0.822789
C  -0.685254 -0.950627 1.050693
C  -1.898971 0.420061 -1.921277
C  0.904089 0.459461 -0.287254
C  1.659597 1.215535 0.60738
C  1.575169 -0.038852 -1.401509
C  3.001548 1.492695 0.395918
C  2.913799 0.219415 -1.637132
C  1.377802 -2.372984 1.116323
C  3.621824 0.993358 -0.735119
C  0.625765 -3.978351 0.041793
H  -0.920653 2.257895 -0.017975
H  -1.812261 1.402827 1.222147
H  -2.975712 2.164383 -1.155072
H  -1.726891 -1.250699 1.154532
H  -0.361829 -0.519097 1.996971
H  -2.567826 -0.127962 -2.583245
H  -1.311868 1.123322 -2.532231
H  1.033391 -0.661081 -2.098656
H  3.553106 2.088354 1.10932
H  3.401907 -0.188553 -2.510813
H  1.987816 -1.683959 1.681204
H  0.559642 -4.933092 -0.456123
totalener: -4236.76615512 hartree
nucrepener: 2312.64599670 hartree
electener: -6549.41215182 hartree
twoeener: 3915.20202043 hartree
kineticenergy: 4228.68702786 hartree
xcener: -184.138915704660 hartree
chargesum: -0.0000000
charge: -0.126942 -0.070096 -0.060679 -0.330205 0.118690 -0.288379 -0.327178 0.441729 -0.227828 0.014454 -0.145296 -0.020204 -0.118435 -0.124959 -0.103961 -0.105393 -0.137156 0.023337 0.096877 0.055679 0.111525 0.106283 0.122587 0.124235 0.128614 0.103064 0.080735 0.143050 0.116536 0.126652 0.141547 0.131116
qa: -0.1269 -0.0701 -0.0607 -0.3302 0.1187 -0.2884 -0.3272 0.4417 -0.2278 0.0145 -0.1453 -0.0202 -0.1184 -0.1250 -0.1040 -0.1054 -0.1372 0.0233 0.0969 0.0557 0.1115 0.1063 0.1226 0.1242 0.1286 0.1031 0.0807 0.1431 0.1165 0.1267 0.1415 0.1311
va: 1.1377 1.2609 1.2444 2.0200 3.3388 2.8843 3.0641 3.6164 3.8948 4.0362 3.8800 4.0076 3.5349 4.0145 3.8794 4.0321 4.0571 4.0893 3.9492 4.0481 1.0102 1.0199 0.9976 1.0344 1.0123 1.0038 0.9893 1.0301 1.0238 1.0128 1.0001 1.0014
dispcorr: -0.020460297 hartree
energy: -4236.786615418647
dipole: 28.73255 -28.99938 -0.26683 -6.60921 8.25510 1.64589 -4.50661 4.19509 -0.31152
magnitude: 1.69623 au
magnitude: 4.31148 debye
