program: Orca
programVersion: 4.2.1
elementType: O O N N N C C C C C C C C C C C C C C C C C C C C H H H H H H H H H H H H H H H H H H H H H H H
charge: 0
multiplicity: 1
keywords: wb97x-d3
keywords: def2-TZVPP
keywords: def2/J RIJCOSX GRIDX6 NOFINALGRIDX
keywords: grid4 nofinalgrid
keywords: scfconv7
keywords: smallprint printgap noloewdin
keywords: NOSOSCF
formula: C20H23N3O2
InChI: InChI=1/C20H23N3O2/c1-20(2,3)18(24)19(23-14-21-13-22-23)25-17-11-9-16(10-12-17)15-7-5-4-6-8-15/h4-14,18-19,24H,1-3H3
48 atoms
O  3.920114 0.235196 1.366067
O  1.336267 0.487137 0.507216
N  2.153158 -1.59683 -0.157711
N  2.41269 -2.170275 1.024046
N  1.95818 -3.72944 -0.520106
C  3.991567 1.763045 -0.486819
C  3.657724 0.333207 -0.010902
C  2.237302 -0.156228 -0.338732
C  3.723512 1.879947 -1.988129
C  3.215853 2.854654 0.252092
C  5.491112 1.980982 -0.25128
C  -0.005252 0.399074 0.30695
C  1.886732 -2.539521 -1.063223
C  -0.616143 -0.209916 -0.782014
C  -0.791364 0.990829 1.292367
C  2.279367 -3.442952 0.755389
C  -2.805165 0.336248 0.118407
C  -2.002386 -0.240073 -0.861118
C  -2.168547 0.962281 1.192872
C  -4.277523 0.283866 0.03249
C  -4.926773 -0.871925 -0.405412
C  -5.054748 1.38514 0.396232
C  -6.311162 -0.925947 -0.474175
C  -6.438941 1.331679 0.325782
C  -7.073445 0.175386 -0.108328
H  4.316432 -0.335788 -0.58667
H  2.022134 0.017885 -1.39691
H  4.214849 1.084556 -2.553635
H  2.659491 1.857345 -2.232065
H  4.108594 2.830023 -2.36245
H  2.151084 2.844105 0.023039
H  3.597585 3.833308 -0.046441
H  3.329308 2.781949 1.333577
H  5.749909 1.971129 0.807524
H  5.796394 2.949774 -0.651859
H  6.090972 1.216265 -0.751214
H  3.723602 -0.66784 1.655278
H  1.662521 -2.319962 -2.095373
H  -0.053644 -0.653377 -1.590649
H  -0.317134 1.465205 2.141903
H  2.424808 -4.197583 1.511807
H  -2.4555 -0.712416 -1.723436
H  -2.755519 1.414994 1.981857
H  -4.347439 -1.746527 -0.674348
H  -4.575173 2.300232 0.721007
H  -6.795066 -1.834795 -0.807194
H  -7.022575 2.198723 0.606208
H  -8.153329 0.13285 -0.160246
elementType: O N C H
totalener: -1090.77537108 hartree
nucrepener: 2139.27821178 hartree
electener: -3230.05358286 hartree
oneelecener: -5731.30619813 hartree
twoeener: 2501.25261527 hartree
cpcmener: -0.03758279 hartree
kineticenergy: 1086.02124999 hartree
xcener: -106.816615882375 hartree
chargesum: 0.0000000
charge: -0.444923 -0.286793 0.114904 -0.391774 -0.410486 0.239223 0.102539 0.067686 -0.365116 -0.343566 -0.340540 0.329029 0.088584 -0.220591 -0.257313 0.094634 0.114551 -0.223205 -0.151438 0.101769 -0.208678 -0.214044 -0.176867 -0.173621 -0.155166 0.121396 0.159095 0.109578 0.096099 0.100938 0.091558 0.100922 0.094948 0.097052 0.095396 0.098055 0.233994 0.182256 0.143351 0.140673 0.167608 0.148829 0.149161 0.148644 0.147359 0.161235 0.160559 0.162495
qa: -0.4449 -0.2868 0.1149 -0.3918 -0.4105 0.2392 0.1025 0.0677 -0.3651 -0.3436 -0.3405 0.3290 0.0886 -0.2206 -0.2573 0.0946 0.1146 -0.2232 -0.1514 0.1018 -0.2087 -0.2140 -0.1769 -0.1736 -0.1552 0.1214 0.1591 0.1096 0.0961 0.1009 0.0916 0.1009 0.0949 0.0971 0.0954 0.0981 0.2340 0.1823 0.1434 0.1407 0.1676 0.1488 0.1492 0.1486 0.1474 0.1612 0.1606 0.1625
va: 1.9971 2.1120 3.2996 2.8726 3.0367 3.6578 3.9293 3.9842 3.9386 3.9410 3.9193 3.6851 4.0469 3.9482 4.0412 4.0122 3.5542 4.0259 3.9304 3.5062 3.9347 3.9396 3.9145 3.9135 3.8821 1.0013 0.9732 1.0037 1.0013 1.0048 1.0076 1.0043 1.0208 1.0162 1.0060 1.0036 1.0401 0.9889 1.0163 1.0126 0.9909 1.0035 1.0002 1.0041 1.0051 0.9920 0.9922 0.9889
dispcorr: -0.023826875 hartree
energy: -1090.799197951375
dipole: 14.60360 -14.83768 -0.23408 15.46954 -15.05413 0.41540 -6.57158 4.87700 -1.69458
magnitude: 1.76038 au
magnitude: 4.47454 debye
