program: Orca
programVersion: 4.2.1
elementType: O O N N N C C C C C C C C C C C C C C C C C C C C H H H H H H H H H H H H H H H H H H H H H H H
charge: 0
multiplicity: 1
keywords: wb97x-d3
keywords: def2-TZVPP
keywords: def2/J RIJCOSX GRIDX6 NOFINALGRIDX
keywords: grid4 nofinalgrid
keywords: scfconv7
keywords: smallprint printgap noloewdin
keywords: NOSOSCF
formula: C20H23N3O2
InChI: InChI=1/C20H23N3O2/c1-20(2,3)18(24)19(23-14-21-13-22-23)25-17-11-9-16(10-12-17)15-7-5-4-6-8-15/h4-14,18-19,24H,1-3H3
48 atoms
O  3.938143 0.256414 1.350354
O  1.332314 0.424649 0.548977
N  2.195293 -1.632249 -0.142755
N  2.512236 -2.204758 1.025389
N  2.042849 -3.76731 -0.510787
C  3.924074 1.780766 -0.507173
C  3.645033 0.342432 -0.021446
C  2.233018 -0.189293 -0.318657
C  3.619443 1.885771 -2.002419
C  3.130838 2.849171 0.247208
C  5.420696 2.046353 -0.303761
C  -0.009041 0.353676 0.339768
C  1.924807 -2.577387 -1.044768
C  -0.621651 -0.271426 -0.738896
C  -0.792966 0.980632 1.30515
C  2.405354 -3.479099 0.753291
C  -2.808116 0.33526 0.12816
C  -2.007418 -0.278266 -0.830055
C  -2.16954 0.97304 1.19469
C  -4.280207 0.309722 0.0282
C  -4.947883 -0.841022 -0.395069
C  -5.03906 1.432649 0.363418
C  -6.332322 -0.869267 -0.476422
C  -6.423297 1.404811 0.280728
C  -7.076277 0.253148 -0.137956
H  4.312278 -0.307741 -0.608894
H  1.98842 -0.017369 -1.370556
H  4.123982 1.1063 -2.578279
H  2.551582 1.827541 -2.221831
H  3.96385 2.847456 -2.386131
H  3.476448 3.838822 -0.058649
H  3.268241 2.779752 1.326244
H  2.062206 2.806767 0.040089
H  5.700304 2.053532 0.749648
H  5.688003 3.020286 -0.717899
H  6.034079 1.296322 -0.809016
H  3.792311 -0.655051 1.640753
H  1.65972 -2.359093 -2.067353
H  -0.061102 -0.746159 -1.530779
H  -0.31737 1.466798 2.147249
H  2.594957 -4.233575 1.499975
H  -2.461233 -0.762433 -1.685363
H  -2.755015 1.453339 1.968321
H  -4.383413 -1.731519 -0.642514
H  -4.544673 2.344126 0.675789
H  -6.830807 -1.774396 -0.797785
H  -6.992372 2.288117 0.539401
H  -8.156244 0.230571 -0.19952
elementType: O N C H
totalener: -1090.77554210 hartree
nucrepener: 2138.06756233 hartree
electener: -3228.84310443 hartree
oneelecener: -5728.85911939 hartree
twoeener: 2500.01601497 hartree
cpcmener: -0.03772002 hartree
kineticenergy: 1086.02380013 hartree
xcener: -106.817142817176 hartree
chargesum: 0.0000000
charge: -0.445229 -0.286875 0.117682 -0.392389 -0.410794 0.239835 0.104955 0.061367 -0.365664 -0.343557 -0.339698 0.337119 0.088359 -0.223358 -0.260472 0.093913 0.113144 -0.225659 -0.148355 0.099847 -0.208578 -0.214172 -0.176771 -0.173927 -0.154603 0.122146 0.161438 0.110257 0.095831 0.100906 0.101014 0.095310 0.090986 0.096279 0.095545 0.098195 0.233909 0.182377 0.143454 0.140868 0.167689 0.148740 0.149235 0.148043 0.147559 0.161242 0.160612 0.162243
qa: -0.4452 -0.2869 0.1177 -0.3924 -0.4108 0.2398 0.1050 0.0614 -0.3657 -0.3436 -0.3397 0.3371 0.0884 -0.2234 -0.2605 0.0939 0.1131 -0.2257 -0.1484 0.0998 -0.2086 -0.2142 -0.1768 -0.1739 -0.1546 0.1221 0.1614 0.1103 0.0958 0.1009 0.1010 0.0953 0.0910 0.0963 0.0955 0.0982 0.2339 0.1824 0.1435 0.1409 0.1677 0.1487 0.1492 0.1480 0.1476 0.1612 0.1606 0.1622
va: 1.9960 2.1118 3.2964 2.8713 3.0359 3.6588 3.9253 3.9867 3.9387 3.9427 3.9202 3.6813 4.0473 3.9487 4.0421 4.0126 3.5567 4.0298 3.9289 3.5073 3.9357 3.9402 3.9143 3.9135 3.8818 1.0010 0.9714 1.0034 1.0012 1.0051 1.0044 1.0207 1.0066 1.0162 1.0060 1.0036 1.0395 0.9885 1.0179 1.0127 0.9909 1.0034 1.0001 1.0043 1.0050 0.9920 0.9922 0.9890
dispcorr: -0.023821763 hartree
energy: -1090.799363860006
dipole: 13.97893 -14.24901 -0.27008 15.78953 -15.35946 0.43007 -6.79802 5.10005 -1.69797
magnitude: 1.77229 au
magnitude: 4.50480 debye
