program: Orca
programVersion: 4.2.1
elementType: O O N N N C C C C C C C C C C C C C C C C C C C C H H H H H H H H H H H H H H H H H H H H H H H
charge: 0
multiplicity: 1
keywords: wb97x-d3
keywords: def2-TZVPP
keywords: def2/J RIJCOSX GRIDX6 NOFINALGRIDX
keywords: grid4 nofinalgrid
keywords: scfconv7
keywords: smallprint printgap noloewdin
keywords: NOSOSCF
formula: C20H23N3O2
InChI: InChI=1/C20H23N3O2/c1-20(2,3)18(24)19(23-14-21-13-22-23)25-17-11-9-16(10-12-17)15-7-5-4-6-8-15/h4-14,18-19,24H,1-3H3
48 atoms
O  2.910529 2.514266 0.135981
O  1.04358 0.809607 0.807067
N  2.19747 -1.047033 0.039633
N  2.157256 -1.854916 -1.024945
N  2.492151 -3.038315 0.850369
C  4.602551 0.848866 -0.470015
C  3.304458 1.171488 0.314793
C  2.044261 0.386232 -0.078127
C  5.640185 1.910053 -0.076072
C  5.183827 -0.5138 -0.078227
C  4.386719 0.905765 -1.981668
C  -0.270097 0.580084 0.537838
C  2.396852 -1.766461 1.148077
C  -0.758443 -0.037432 -0.606695
C  -1.1590 1.024339 1.51332
C  2.344986 -3.033225 -0.490335
C  -3.036321 0.246588 0.196674
C  -2.129626 -0.194126 -0.763817
C  -2.5189 0.859523 1.340811
C  -4.49112 0.072605 0.017765
C  -5.076246 0.17828 -1.246004
C  -5.318997 -0.19952 1.109245
C  -6.443257 0.014597 -1.413334
C  -6.686494 -0.359999 0.942521
C  -7.255266 -0.254797 -0.319685
H  3.505594 0.967817 1.378171
H  1.782811 0.588011 -1.120968
H  6.611883 1.65445 -0.500548
H  5.389878 2.905313 -0.446345
H  5.768811 1.970328 1.008118
H  6.207238 -0.593052 -0.449638
H  4.641823 -1.35593 -0.505161
H  5.22526 -0.64373 1.00562
H  3.952114 1.856289 -2.294673
H  3.739853 0.103138 -2.340577
H  5.341051 0.798763 -2.501034
H  3.510336 3.077513 0.634094
H  2.459234 -1.33866 2.136041
H  -0.106515 -0.414546 -1.382364
H  -0.77733 1.511379 2.401518
H  2.368867 -3.929163 -1.089982
H  -2.487329 -0.695001 -1.654363
H  -3.18657 1.23538 2.105428
H  -4.461964 0.410351 -2.107098
H  -4.891978 -0.306423 2.098643
H  -6.875623 0.107287 -2.400999
H  -7.308362 -0.575314 1.801624
H  -8.321984 -0.380824 -0.449791
elementType: O N C H
totalener: -1090.77402717 hartree
nucrepener: 2133.61042489 hartree
electener: -3224.38445206 hartree
oneelecener: -5720.37835466 hartree
twoeener: 2495.99390260 hartree
cpcmener: -0.03673918 hartree
kineticenergy: 1086.00100841 hartree
xcener: -106.811219721569 hartree
chargesum: 0.0000000
charge: -0.416278 -0.307531 0.122900 -0.355553 -0.394176 0.233948 0.066228 0.105066 -0.354180 -0.364057 -0.356522 0.305192 0.056420 -0.190225 -0.270440 0.084426 0.112223 -0.219424 -0.153821 0.094413 -0.203613 -0.211285 -0.176204 -0.173982 -0.153859 0.126336 0.156099 0.094267 0.094693 0.114561 0.104828 0.096421 0.108589 0.102286 0.087370 0.103019 0.233769 0.185444 0.135177 0.143684 0.163839 0.147332 0.147303 0.146028 0.145977 0.160604 0.160152 0.162558
qa: -0.4163 -0.3075 0.1229 -0.3556 -0.3942 0.2339 0.0662 0.1051 -0.3542 -0.3641 -0.3565 0.3052 0.0564 -0.1902 -0.2704 0.0844 0.1122 -0.2194 -0.1538 0.0944 -0.2036 -0.2113 -0.1762 -0.1740 -0.1539 0.1263 0.1561 0.0943 0.0947 0.1146 0.1048 0.0964 0.1086 0.1023 0.0874 0.1030 0.2338 0.1854 0.1352 0.1437 0.1638 0.1473 0.1473 0.1460 0.1460 0.1606 0.1602 0.1626
va: 1.9990 2.0701 3.3010 2.8385 3.0479 3.6273 4.0156 3.8740 3.9202 3.9545 3.9279 3.7406 4.0773 3.9102 4.0506 4.0064 3.5647 4.0133 3.9487 3.5281 3.9345 3.9423 3.9147 3.9156 3.8824 1.0027 0.9866 1.0073 1.0126 0.9990 1.0097 1.0027 1.0025 1.0190 1.0162 1.0048 1.0045 0.9951 1.0295 1.0118 0.9946 1.0040 1.0007 1.0050 1.0054 0.9923 0.9924 0.9889
dispcorr: -0.024345676 hartree
energy: -1090.798372846540
dipole: 20.92140 -19.97055 0.95086 6.59945 -5.54811 1.05135 -4.60578 4.99490 0.38912
magnitude: 1.46999 au
magnitude: 3.73642 debye
