program: Orca
programVersion: 4.2.1
elementType: O O N N N C C C C C C C C C C C C C C C C C C C C H H H H H H H H H H H H H H H H H H H H H H H
charge: 0
multiplicity: 1
keywords: wb97x-d3
keywords: def2-TZVPP
keywords: def2/J RIJCOSX GRIDX6 NOFINALGRIDX
keywords: grid4 nofinalgrid
keywords: scfconv7
keywords: smallprint printgap noloewdin
keywords: NOSOSCF
formula: C20H23N3O2
InChI: InChI=1/C20H23N3O2/c1-20(2,3)18(24)19(23-14-21-13-22-23)25-17-11-9-16(10-12-17)15-7-5-4-6-8-15/h4-14,18-19,24H,1-3H3
48 atoms
O  2.953635 2.489584 0.485593
O  1.044592 0.742756 0.887266
N  2.172553 -1.004171 -0.138802
N  2.144606 -1.63956 -1.314743
N  2.400911 -3.102285 0.365567
C  4.625907 0.886749 -0.314441
C  3.315986 1.126115 0.4804
C  2.047481 0.433463 -0.041528
C  5.675325 1.855741 0.248576
C  5.168921 -0.531318 -0.106994
C  4.448934 1.161088 -1.806875
C  -0.268308 0.537695 0.595117
C  2.324555 -1.888366 0.851618
C  -0.755247 0.052524 -0.611989
C  -1.156435 0.859873 1.618181
C  2.291653 -2.890033 -0.962004
C  -3.030403 0.213382 0.229597
C  -2.125432 -0.104304 -0.77938
C  -2.515476 0.702245 1.43277
C  -4.483904 0.041124 0.04036
C  -5.385408 0.978203 0.54958
C  -4.99181 -1.062494 -0.647793
C  -6.751893 0.817967 0.374035
C  -6.358405 -1.222699 -0.823458
C  -7.244612 -0.282934 -0.313863
H  3.486802 0.769472 1.508093
H  1.803053 0.794315 -1.045196
H  5.454707 2.899236 0.019698
H  5.779578 1.757812 1.332659
H  6.651287 1.640305 -0.188021
H  4.620868 -1.29226 -0.660097
H  5.180366 -0.813709 0.948161
H  6.199563 -0.581954 -0.463129
H  4.051155 2.159921 -1.992869
H  3.787077 0.438112 -2.286785
H  5.411939 1.095219 -2.317071
H  3.54807 2.961114 1.076653
H  2.368141 -1.617868 1.894715
H  -0.103427 -0.205571 -1.435052
H  -0.773311 1.230411 2.560394
H  2.313285 -3.684791 -1.690554
H  -2.486495 -0.468627 -1.732825
H  -3.183105 0.945436 2.249546
H  -5.016901 1.852433 1.071919
H  -4.315381 -1.815957 -1.031884
H  -7.4331 1.560016 0.769631
H  -6.731636 -2.089881 -1.352375
H  -8.310567 -0.407661 -0.451197
elementType: O N C H
totalener: -1090.77382534 hartree
nucrepener: 2135.44228869 hartree
electener: -3226.21611403 hartree
oneelecener: -5724.03590326 hartree
twoeener: 2497.81978923 hartree
cpcmener: -0.03640190 hartree
kineticenergy: 1086.00065349 hartree
xcener: -106.810780141752 hartree
chargesum: -0.0000000
charge: -0.416026 -0.307290 0.116058 -0.355858 -0.392382 0.236621 0.061347 0.116735 -0.353371 -0.365937 -0.356313 0.300981 0.056150 -0.188044 -0.271336 0.084888 0.114062 -0.226663 -0.153805 0.101544 -0.214921 -0.208504 -0.174005 -0.175291 -0.155081 0.125761 0.155403 0.094001 0.113858 0.094671 0.097323 0.108822 0.104964 0.102055 0.087841 0.103166 0.233857 0.185333 0.137594 0.143681 0.163408 0.147928 0.148780 0.147252 0.146784 0.160380 0.160867 0.162713
qa: -0.4160 -0.3073 0.1161 -0.3559 -0.3924 0.2366 0.0613 0.1167 -0.3534 -0.3659 -0.3563 0.3010 0.0562 -0.1880 -0.2713 0.0849 0.1141 -0.2267 -0.1538 0.1015 -0.2149 -0.2085 -0.1740 -0.1753 -0.1551 0.1258 0.1554 0.0940 0.1139 0.0947 0.0973 0.1088 0.1050 0.1021 0.0878 0.1032 0.2339 0.1853 0.1376 0.1437 0.1634 0.1479 0.1488 0.1473 0.1468 0.1604 0.1609 0.1627
va: 1.9989 2.0718 3.2992 2.8377 3.0510 3.6246 4.0200 3.8591 3.9219 3.9521 3.9279 3.7453 4.0779 3.9082 4.0476 4.0064 3.5512 4.0146 3.9437 3.5095 3.9417 3.9370 3.9147 3.9144 3.8830 1.0028 0.9884 1.0130 0.9990 1.0071 1.0023 1.0025 1.0096 1.0189 1.0167 1.0044 1.0042 0.9957 1.0293 1.0117 0.9949 1.0035 1.0000 1.0053 1.0049 0.9924 0.9922 0.9889
dispcorr: -0.024436424 hartree
energy: -1090.798261768150
dipole: 21.12452 -20.17917 0.94535 6.78838 -5.84635 0.94203 -3.23490 3.81125 0.57635
magnitude: 1.45371 au
magnitude: 3.69505 debye
