program: Orca
programVersion: 4.2.1
elementType: O O N N N C C C C C C C C C C C C C C C C C C C C H H H H H H H H H H H H H H H H H H H H H H H
charge: 0
multiplicity: 1
keywords: wb97x-d3
keywords: def2-TZVPP
keywords: def2/J RIJCOSX GRIDX6 NOFINALGRIDX
keywords: grid4 nofinalgrid
keywords: scfconv7
keywords: smallprint printgap noloewdin
keywords: NOSOSCF
formula: C20H23N3O2
InChI: InChI=1/C20H23N3O2/c1-20(2,3)18(24)19(23-14-21-13-22-23)25-17-11-9-16(10-12-17)15-7-5-4-6-8-15/h4-14,18-19,24H,1-3H3
48 atoms
O  3.09941 2.461837 0.510382
O  1.117627 0.762328 1.060823
N  2.061548 -1.018723 -0.083746
N  1.768509 -1.653042 -1.222929
N  2.304662 -3.12407 0.383005
C  4.473354 0.90701 -0.680421
C  3.349785 1.082969 0.366494
C  2.005798 0.420613 0.020798
C  5.00258 -0.530609 -0.698158
C  4.009317 1.295905 -2.084757
C  5.64034 1.81327 -0.26888
C  -0.220047 0.607551 0.785489
C  2.37441 -1.907292 0.862731
C  -0.939212 -0.357315 1.472098
C  -0.850926 1.42606 -0.14043
C  1.936712 -2.907154 -0.895181
C  -2.955505 0.311858 0.307064
C  -2.298441 -0.495502 1.235573
C  -2.206084 1.272002 -0.375703
C  -4.402688 0.164242 0.053422
C  -5.194111 1.279314 -0.229274
C  -5.013044 -1.090831 0.085561
C  -6.55164 1.143523 -0.476735
C  -6.371401 -1.22642 -0.159784
C  -7.146598 -0.110315 -0.443728
H  3.708888 0.654472 1.315594
H  1.644256 0.779458 -0.946293
H  5.925156 -0.568661 -1.279947
H  5.241043 -0.889719 0.305056
H  4.319754 -1.239865 -1.163221
H  4.85619 1.286831 -2.773037
H  3.579108 2.297685 -2.114499
H  3.270571 0.599728 -2.486708
H  5.394293 2.871696 -0.329773
H  6.49037 1.638165 -0.930404
H  5.972654 1.602257 0.750058
H  2.475236 2.586571 1.232989
H  2.63939 -1.637029 1.872363
H  -0.445517 -0.987055 2.201165
H  -0.293336 2.185185 -0.674717
H  1.778213 -3.70215 -1.606067
H  -2.850953 -1.237215 1.797778
H  -2.680497 1.905504 -1.113661
H  -4.751975 2.267482 -0.239538
H  -4.420845 -1.97526 0.283623
H  -7.146786 2.021655 -0.689633
H  -6.823164 -2.209241 -0.136899
H  -8.205667 -0.21658 -0.637582
elementType: O N C H
totalener: -1090.77462687 hartree
nucrepener: 2144.38230140 hartree
electener: -3235.15692827 hartree
oneelecener: -5741.54000210 hartree
twoeener: 2506.38307383 hartree
cpcmener: -0.03284934 hartree
kineticenergy: 1086.03605763 hartree
xcener: -106.813480151195 hartree
chargesum: 0.0000000
charge: -0.417081 -0.372263 0.132042 -0.351181 -0.385110 0.252816 0.093402 0.067620 -0.364737 -0.369391 -0.329243 0.231703 0.029800 -0.192894 -0.175940 0.078444 0.130163 -0.184845 -0.207038 0.115855 -0.203972 -0.208284 -0.172486 -0.171695 -0.153974 0.125924 0.154368 0.105381 0.108055 0.096684 0.104074 0.106241 0.087277 0.095475 0.094371 0.099558 0.227583 0.185212 0.150046 0.151479 0.163403 0.146475 0.149604 0.146374 0.145975 0.161042 0.160814 0.162879
qa: -0.4171 -0.3723 0.1320 -0.3512 -0.3851 0.2528 0.0934 0.0676 -0.3647 -0.3694 -0.3292 0.2317 0.0298 -0.1929 -0.1759 0.0784 0.1302 -0.1848 -0.2070 0.1159 -0.2040 -0.2083 -0.1725 -0.1717 -0.1540 0.1259 0.1544 0.1054 0.1081 0.0967 0.1041 0.1062 0.0873 0.0955 0.0944 0.0996 0.2276 0.1852 0.1500 0.1515 0.1634 0.1465 0.1496 0.1464 0.1460 0.1610 0.1608 0.1629
va: 2.0207 1.9736 3.3169 2.8417 3.0493 3.6198 3.9440 3.9409 3.9521 3.9353 3.9165 3.7814 4.0950 4.0161 3.9705 4.0207 3.5389 3.9771 3.9593 3.5205 3.9382 3.9454 3.9107 3.9114 3.8852 0.9989 0.9787 1.0098 1.0036 1.0061 1.0057 1.0155 1.0134 1.0167 1.0056 1.0034 1.0186 0.9967 1.0042 1.0091 0.9948 1.0024 1.0027 1.0049 1.0051 0.9919 0.9918 0.9887
dispcorr: -0.024861743 hartree
energy: -1090.799488615079
dipole: 19.27553 -19.58391 -0.30837 6.54556 -5.86354 0.68202 -6.22334 6.69872 0.47538
magnitude: 0.88670 au
magnitude: 2.25381 debye
