program: Orca
programVersion: 4.2.1
elementType: O O N N N C C C C C C C C C C C C C C C C C C C C H H H H H H H H H H H H H H H H H H H H H H H
charge: 0
multiplicity: 1
keywords: wb97x-d3
keywords: def2-TZVPP
keywords: def2/J RIJCOSX GRIDX6 NOFINALGRIDX
keywords: grid4 nofinalgrid
keywords: scfconv7
keywords: smallprint printgap noloewdin
keywords: NOSOSCF
formula: C20H23N3O2
InChI: InChI=1/C20H23N3O2/c1-20(2,3)18(24)19(23-14-21-13-22-23)25-17-11-9-16(10-12-17)15-7-5-4-6-8-15/h4-14,18-19,24H,1-3H3
48 atoms
O  2.949711 2.356409 0.506505
O  1.073893 0.55798 0.919247
N  2.240263 -1.211633 -0.033966
N  2.009649 -1.956504 -1.12141
N  2.714217 -3.240449 0.577053
C  4.507746 0.934446 -0.606104
C  3.317273 1.003743 0.377217
C  2.050596 0.221703 -0.033064
C  5.066577 -0.485937 -0.733289
C  4.12656 1.452643 -1.993948
C  5.628781 1.810049 -0.032542
C  -0.251468 0.441441 0.628086
C  2.659152 -1.991442 0.966662
C  -1.122866 0.95772 1.583165
C  -0.763099 -0.147075 -0.521329
C  2.309088 -3.159005 -0.706285
C  -3.02852 0.299669 0.239274
C  -2.488611 0.885931 1.387018
C  -2.137938 -0.209665 -0.70183
C  -4.487685 0.216488 0.033306
C  -5.037321 0.318941 -1.246722
C  -5.354891 0.027054 1.111539
C  -6.407259 0.229968 -1.442871
C  -6.72543 -0.057442 0.916008
C  -7.258425 0.0419 -0.362148
H  3.663061 0.604713 1.343641
H  1.738886 0.500917 -1.042773
H  4.419843 -1.15682 -1.296799
H  6.016088 -0.451219 -1.270847
H  5.268242 -0.936313 0.241162
H  3.386214 0.820456 -2.488456
H  5.007169 1.465816 -2.638579
H  3.733296 2.468965 -1.963061
H  5.349965 2.860064 0.038798
H  6.509514 1.748158 -0.67405
H  5.927407 1.472637 0.962912
H  2.343545 2.442135 1.249269
H  2.904295 -1.622437 1.94977
H  -0.725774 1.425473 2.475013
H  -0.127671 -0.582735 -1.279154
H  2.229239 -4.016299 -1.355522
H  -3.140755 1.31543 2.136619
H  -2.511723 -0.693988 -1.594796
H  -4.392007 0.487458 -2.099867
H  -4.958282 -0.07653 2.113823
H  -6.810399 0.317045 -2.44334
H  -7.377893 -0.210394 1.765696
H  -8.327432 -0.02612 -0.514623
elementType: O N C H
totalener: -1090.77511047 hartree
nucrepener: 2130.08397614 hartree
electener: -3220.85908661 hartree
oneelecener: -5712.72067320 hartree
twoeener: 2491.86158659 hartree
cpcmener: -0.03279926 hartree
kineticenergy: 1086.00613357 hartree
xcener: -106.812852168692 hartree
chargesum: 0.0000000
charge: -0.424964 -0.328883 0.128789 -0.362458 -0.398454 0.265132 0.114792 0.041057 -0.378231 -0.364237 -0.336316 0.333981 0.061140 -0.274479 -0.203795 0.091546 0.108092 -0.149231 -0.222555 0.093974 -0.204179 -0.209826 -0.176664 -0.174424 -0.153428 0.132204 0.162621 0.100327 0.105460 0.108438 0.091055 0.102595 0.102463 0.096394 0.095127 0.099044 0.229830 0.182548 0.144206 0.137402 0.164905 0.147991 0.146225 0.145893 0.145028 0.160783 0.160285 0.162798
qa: -0.4250 -0.3289 0.1288 -0.3625 -0.3985 0.2651 0.1148 0.0411 -0.3782 -0.3642 -0.3363 0.3340 0.0611 -0.2745 -0.2038 0.0915 0.1081 -0.1492 -0.2226 0.0940 -0.2042 -0.2098 -0.1767 -0.1744 -0.1534 0.1322 0.1626 0.1003 0.1055 0.1084 0.0911 0.1026 0.1025 0.0964 0.0951 0.0990 0.2298 0.1825 0.1442 0.1374 0.1649 0.1480 0.1462 0.1459 0.1450 0.1608 0.1603 0.1628
va: 2.0125 2.0497 3.2838 2.8305 3.0466 3.6163 3.9487 3.9496 3.9604 3.9371 3.9087 3.7313 4.0747 4.0453 3.9163 4.0012 3.5774 3.9457 4.0312 3.5327 3.9358 3.9433 3.9148 3.9154 3.8831 0.9949 0.9838 1.0080 1.0100 1.0037 1.0063 1.0040 1.0182 1.0195 1.0059 1.0026 1.0160 0.9949 1.0108 1.0382 0.9931 1.0007 1.0045 1.0051 1.0058 0.9923 0.9924 0.9888
dispcorr: -0.024191290 hartree
energy: -1090.799301760932
dipole: 19.15385 -19.15436 -0.00051 7.74916 -7.01977 0.72939 -5.62689 6.11712 0.49022
magnitude: 0.87882 au
magnitude: 2.23379 debye
