program: Orca
programVersion: 4.2.1
elementType: O O N N N C C C C C C C C C C C C C C C C C C C C H H H H H H H H H H H H H H H H H H H H H H H
charge: 0
multiplicity: 1
keywords: wb97x-d3
keywords: def2-TZVPP
keywords: def2/J RIJCOSX GRIDX6 NOFINALGRIDX
keywords: grid4 nofinalgrid
keywords: scfconv7
keywords: smallprint printgap noloewdin
keywords: NOSOSCF
formula: C20H23N3O2
InChI: InChI=1/C20H23N3O2/c1-20(2,3)18(24)19(23-14-21-13-22-23)25-17-11-9-16(10-12-17)15-7-5-4-6-8-15/h4-14,18-19,24H,1-3H3
48 atoms
O  3.429003 2.081513 1.153663
O  1.208126 0.725941 1.137767
N  1.956584 -0.974072 -0.247951
N  2.3818 -1.924195 0.589075
N  1.28317 -2.833783 -1.137638
C  4.539506 0.951495 -0.616011
C  3.498139 0.830956 0.519397
C  2.077504 0.428672 0.068259
C  4.2022 2.098927 -1.57089
C  5.900424 1.226391 0.033564
C  4.658421 -0.345829 -1.419106
C  -0.127349 0.571414 0.874274
C  1.28921 -1.531625 -1.265492
C  -0.816291 -0.464815 1.485441
C  -0.789851 1.443965 0.021771
C  1.963229 -3.020069 0.013407
C  -2.855924 0.229851 0.378649
C  -2.17096 -0.625616 1.241804
C  -2.14203 1.268282 -0.221537
C  -4.294141 0.039954 0.10211
C  -4.830054 -1.241542 -0.037631
C  -5.148565 1.135381 -0.034554
C  -6.178316 -1.421948 -0.307552
C  -6.496744 0.954972 -0.30524
C  -7.01748 -0.324453 -0.443596
H  3.848532 0.058012 1.218196
H  1.780804 0.972539 -0.834828
H  3.240964 1.961885 -2.07186
H  4.179956 3.065436 -1.067451
H  4.956761 2.160846 -2.358185
H  5.916488 2.165034 0.586927
H  6.678207 1.284251 -0.730573
H  6.182274 0.426506 0.722948
H  3.796287 -0.530856 -2.060303
H  4.800885 -1.21905 -0.779582
H  5.525008 -0.285593 -2.080495
H  2.92029 1.994457 1.965942
H  0.843882 -0.956221 -2.062618
H  -0.298187 -1.137458 2.157262
H  -0.258704 2.259988 -0.45288
H  2.155549 -3.993926 0.436298
H  -2.699308 -1.426739 1.74319
H  -2.640118 1.94373 -0.905664
H  -4.185859 -2.10856 0.042146
H  -4.763529 2.139925 0.090688
H  -6.571723 -2.424042 -0.420345
H  -7.143171 1.817817 -0.401721
H  -8.069317 -0.46517 -0.656238
elementType: O N C H
totalener: -1090.78401277 hartree
nucrepener: 2154.24162389 hartree
electener: -3245.02563666 hartree
oneelecener: -5761.29312469 hartree
twoeener: 2516.26748803 hartree
cpcmener: -0.02924403 hartree
kineticenergy: 1086.00890042 hartree
xcener: -106.808887230640 hartree
chargesum: -0.0000000
charge: -0.405374 -0.354359 0.134731 -0.367940 -0.381889 0.259035 0.105568 0.044360 -0.362961 -0.340832 -0.362754 0.198748 0.064405 -0.167694 -0.166300 0.081644 0.145112 -0.197631 -0.201225 0.117263 -0.210938 -0.207248 -0.166876 -0.167699 -0.151342 0.119958 0.147735 0.090514 0.101705 0.100656 0.098180 0.094476 0.098129 0.095284 0.103893 0.102467 0.221132 0.178521 0.140296 0.150505 0.162517 0.145547 0.147367 0.144689 0.145211 0.157448 0.156893 0.159071
qa: -0.4054 -0.3544 0.1347 -0.3679 -0.3819 0.2590 0.1056 0.0444 -0.3630 -0.3408 -0.3628 0.1987 0.0644 -0.1677 -0.1663 0.0816 0.1451 -0.1976 -0.2012 0.1173 -0.2109 -0.2072 -0.1669 -0.1677 -0.1513 0.1200 0.1477 0.0905 0.1017 0.1007 0.0982 0.0945 0.0981 0.0953 0.1039 0.1025 0.2211 0.1785 0.1403 0.1505 0.1625 0.1455 0.1474 0.1447 0.1452 0.1574 0.1569 0.1591
va: 2.0306 2.0040 3.2797 2.8786 3.0555 3.6503 3.9279 3.9976 3.9435 3.9058 3.9632 3.8095 4.0454 3.9604 3.9441 4.0173 3.5195 3.9831 3.9652 3.5112 3.9520 3.9464 3.9190 3.9172 3.8940 1.0189 0.9773 1.0045 1.0182 1.0026 1.0191 1.0056 1.0033 1.0006 1.0113 1.0093 1.0219 0.9960 1.0153 1.0041 0.9948 1.0024 1.0030 1.0054 1.0055 0.9929 0.9932 0.9900
dispcorr: -0.024990284 hartree
energy: -1090.809003056277
dipole: 19.28679 -19.78195 -0.49516 7.30905 -6.64657 0.66248 -7.38146 6.87584 -0.50562
magnitude: 0.96939 au
magnitude: 2.46400 debye
