program: Orca
programVersion: 4.2.1
elementType: O O N N N C C C C C C C C C C C C C C C C C C C C H H H H H H H H H H H H H H H H H H H H H H H
charge: 0
multiplicity: 1
keywords: wb97x-d3
keywords: def2-TZVPP
keywords: def2/J RIJCOSX GRIDX6 NOFINALGRIDX
keywords: grid4 nofinalgrid
keywords: scfconv7
keywords: smallprint printgap noloewdin
keywords: NOSOSCF
formula: C20H23N3O2
InChI: InChI=1/C20H23N3O2/c1-20(2,3)18(24)19(23-14-21-13-22-23)25-17-11-9-16(10-12-17)15-7-5-4-6-8-15/h4-14,18-19,24H,1-3H3
48 atoms
O  3.927654 0.29238 1.34477
O  1.326704 0.427616 0.541754
N  2.198137 -1.633423 -0.115578
N  2.532308 -2.165125 1.065596
N  2.083736 -3.777621 -0.414899
C  3.920816 1.774245 -0.54019
C  3.640135 0.345847 -0.024445
C  2.227769 -0.192539 -0.317445
C  3.624693 1.850306 -2.039034
C  3.122258 2.855139 0.190681
C  5.41645 2.042887 -0.333164
C  -0.012867 0.350914 0.337703
C  1.937419 -2.609729 -0.989458
C  -0.796865 0.969915 1.308184
C  -0.626982 -0.268391 -0.74342
C  2.447527 -3.450561 0.839708
C  -2.813147 0.333127 0.12828
C  -2.173522 0.962883 1.198733
C  -2.012755 -0.274735 -0.83366
C  -4.285321 0.309969 0.025238
C  -4.954165 -0.845967 -0.38127
C  -5.042888 1.440431 0.336475
C  -6.337887 -0.871294 -0.472395
C  -6.426602 1.41537 0.244424
C  -7.08042 0.259218 -0.159596
H  4.308728 -0.317603 -0.597955
H  1.98335 -0.037041 -1.372129
H  2.556828 1.805361 -2.263325
H  3.986205 2.796414 -2.445743
H  4.118397 1.050194 -2.596417
H  3.24875 2.799762 1.271969
H  2.055042 2.811014 -0.025114
H  3.469972 3.841088 -0.125911
H  5.694833 2.038347 0.720635
H  5.683553 3.021295 -0.73732
H  6.033209 1.299581 -0.844755
H  3.744755 -0.601863 1.667628
H  1.654816 -2.425295 -2.014232
H  -0.320325 1.450798 2.153196
H  -0.066218 -0.739146 -1.538046
H  2.656772 -4.178501 1.607762
H  -2.75818 1.437414 1.976874
H  -2.467364 -0.752899 -1.692259
H  -4.391027 -1.743289 -0.607196
H  -4.548061 2.356539 0.635292
H  -6.837012 -1.780896 -0.780996
H  -6.99471 2.30525 0.483453
H  -8.160275 0.239297 -0.22951
elementType: O N C H
totalener: -1090.78615660 hartree
nucrepener: 2137.83341212 hartree
electener: -3228.61956872 hartree
oneelecener: -5728.30239979 hartree
twoeener: 2499.68283107 hartree
cpcmener: -0.03151056 hartree
kineticenergy: 1086.01323914 hartree
xcener: -106.814596455193 hartree
chargesum: 0.0000000
charge: -0.424111 -0.278407 0.117083 -0.389081 -0.404391 0.237865 0.095243 0.063069 -0.367443 -0.339257 -0.337936 0.332024 0.087128 -0.253429 -0.219062 0.094028 0.114657 -0.147973 -0.224489 0.105321 -0.209385 -0.213298 -0.172202 -0.169556 -0.151260 0.117786 0.155844 0.095009 0.101190 0.108369 0.097104 0.089050 0.099006 0.099464 0.093999 0.095665 0.225498 0.179142 0.139127 0.134870 0.166086 0.147524 0.146093 0.145896 0.145414 0.157627 0.156600 0.158500
qa: -0.4241 -0.2784 0.1171 -0.3891 -0.4044 0.2379 0.0952 0.0631 -0.3674 -0.3393 -0.3379 0.3320 0.0871 -0.2534 -0.2191 0.0940 0.1147 -0.1480 -0.2245 0.1053 -0.2094 -0.2133 -0.1722 -0.1696 -0.1513 0.1178 0.1558 0.0950 0.1012 0.1084 0.0971 0.0890 0.0990 0.0995 0.0940 0.0957 0.2255 0.1791 0.1391 0.1349 0.1661 0.1475 0.1461 0.1459 0.1454 0.1576 0.1566 0.1585
va: 2.0217 2.1211 3.3012 2.8747 3.0396 3.6656 3.9444 3.9892 3.9381 3.9435 3.9186 3.6952 4.0458 4.0418 3.9538 4.0122 3.5630 3.9307 4.0332 3.5087 3.9413 3.9453 3.9202 3.9198 3.8901 1.0009 0.9744 1.0011 1.0054 1.0038 1.0216 1.0070 1.0044 1.0169 1.0063 1.0038 1.0505 0.9895 1.0131 1.0189 0.9912 1.0005 1.0041 1.0048 1.0054 0.9930 0.9933 0.9902
dispcorr: -0.023838275 hartree
energy: -1090.809994872792
dipole: 13.90083 -14.20845 -0.30763 15.67507 -15.28010 0.39496 -7.09576 5.53454 -1.56122
magnitude: 1.63952 au
magnitude: 4.16734 debye
