program: Orca
programVersion: 4.2.1
elementType: O O N N N C C C C C C C C C C C C C C C C C C C C H H H H H H H H H H H H H H H H H H H H H H H
charge: 0
multiplicity: 1
keywords: wb97x-d3
keywords: def2-TZVPP
keywords: def2/J RIJCOSX GRIDX6 NOFINALGRIDX
keywords: grid4 nofinalgrid
keywords: scfconv7
keywords: smallprint printgap noloewdin
keywords: NOSOSCF
formula: C20H23N3O2
InChI: InChI=1/C20H23N3O2/c1-20(2,3)18(24)19(23-14-21-13-22-23)25-17-11-9-16(10-12-17)15-7-5-4-6-8-15/h4-14,18-19,24H,1-3H3
48 atoms
O  3.003236 2.339904 0.719178
O  1.080781 0.523468 0.968303
N  2.19359 -1.119806 -0.238881
N  2.096532 -1.644134 -1.465209
N  2.505409 -3.25034 0.043052
C  4.555537 0.951834 -0.435492
C  3.325328 0.993564 0.500041
C  2.050389 0.299324 -0.019342
C  5.159613 -0.454217 -0.515906
C  4.207453 1.439697 -1.843704
C  5.624287 1.873767 0.167631
C  -0.245453 0.406159 0.673375
C  2.435021 -2.094879 0.650861
C  -0.75022 -0.057479 -0.533842
C  -1.118834 0.789537 1.685547
C  2.294307 -2.921602 -1.248558
C  -3.016701 0.261168 0.281555
C  -2.12481 -0.120504 -0.714178
C  -2.483314 0.717076 1.48753
C  -4.474704 0.180933 0.074667
C  -5.047409 -0.927674 -0.547582
C  -5.314177 1.21055 0.498152
C  -6.417189 -1.004158 -0.741938
C  -6.68439 1.134102 0.306415
C  -7.241617 0.026318 -0.314981
H  3.613647 0.49773 1.444087
H  1.757763 0.73294 -0.980068
H  5.330969 -0.88242 0.47408
H  4.558232 -1.153089 -1.093104
H  6.130748 -0.401386 -1.011054
H  5.115117 1.522627 -2.443691
H  3.737066 2.423075 -1.826773
H  3.546143 0.747213 -2.367864
H  6.540408 1.803259 -0.421144
H  5.872109 1.581789 1.191015
H  5.316283 2.916952 0.182642
H  2.264685 2.384521 1.332214
H  2.539577 -1.923212 1.710669
H  -0.107794 -0.383319 -1.340203
H  -0.720198 1.136508 2.630212
H  2.279958 -3.643584 -2.049615
H  -2.504167 -0.462307 -1.668807
H  -3.147353 0.999039 2.294828
H  -4.416167 -1.750579 -0.859174
H  -4.887292 2.092123 0.960274
H  -6.842742 -1.876968 -1.219548
H  -7.318122 1.94722 0.635419
H  -8.311362 -0.033789 -0.465125
totalener: -1090.75850630 hartree
nucrepener: 2134.75765828 hartree
electener: -3225.51616458 hartree
oneelecener: -5721.47038800 hartree
twoeener: 2495.95422342 hartree
kineticenergy: 1086.01376474 hartree
xcener: -106.809268035940 hartree
chargesum: -0.0000000
charge: -0.335713 -0.323040 0.127508 -0.332574 -0.311597 0.220765 0.094643 0.036219 -0.343732 -0.355544 -0.297483 0.299261 0.035624 -0.156271 -0.236849 0.080938 0.124569 -0.216474 -0.138109 0.114633 -0.191703 -0.197635 -0.136426 -0.136192 -0.116690 0.098592 0.151812 0.093770 0.105744 0.094861 0.092194 0.110451 0.090612 0.083627 0.083800 0.106504 0.180164 0.148227 0.124589 0.115210 0.133818 0.126159 0.126348 0.126135 0.123671 0.124847 0.124501 0.126239
qa: -0.3357 -0.3230 0.1275 -0.3326 -0.3116 0.2208 0.0946 0.0362 -0.3437 -0.3555 -0.2975 0.2993 0.0356 -0.1563 -0.2368 0.0809 0.1246 -0.2165 -0.1381 0.1146 -0.1917 -0.1976 -0.1364 -0.1362 -0.1167 0.0986 0.1518 0.0938 0.1057 0.0949 0.0922 0.1105 0.0906 0.0836 0.0838 0.1065 0.1802 0.1482 0.1246 0.1152 0.1338 0.1262 0.1263 0.1261 0.1237 0.1248 0.1245 0.1262
va: 2.1008 2.0481 3.2396 2.8000 3.0718 3.6998 4.0072 3.9732 3.9533 3.9355 3.9222 3.8206 4.0955 3.9350 4.0855 4.0095 3.6335 4.0646 3.9808 3.5706 3.9901 3.9946 3.9761 3.9776 3.9538 1.0007 0.9908 1.0081 1.0076 1.0126 1.0092 1.0159 1.0133 1.0070 1.0071 1.0172 1.0638 1.0054 1.0423 1.0190 1.0000 1.0098 1.0067 1.0091 1.0103 1.0028 1.0027 0.9996
dispcorr: -0.024487050 hartree
energy: -1090.782993352906
dipole: 19.33702 -19.61045 -0.27343 7.61940 -7.14079 0.47861 -4.04183 4.36033 0.31850
magnitude: 0.63661 au
magnitude: 1.61813 debye
