program: Orca
programVersion: 4.2.1
elementType: O O N N N C C C C C C C C C C C C C C C C C C C C H H H H H H H H H H H H H H H H H H H H H H H
charge: 0
multiplicity: 1
keywords: wb97x-d3
keywords: def2-TZVPP
keywords: def2/J RIJCOSX GRIDX6 NOFINALGRIDX
keywords: grid4 nofinalgrid
keywords: scfconv7
keywords: smallprint printgap noloewdin
keywords: NOSOSCF
formula: C20H23N3O2
InChI: InChI=1/C20H23N3O2/c1-20(2,3)18(24)19(23-14-21-13-22-23)25-17-11-9-16(10-12-17)15-7-5-4-6-8-15/h4-14,18-19,24H,1-3H3
48 atoms
O  -2.600861 -1.283592 -1.386951
O  -0.852231 0.86823 -0.88432
N  -2.978219 1.496995 -0.419481
N  -3.686918 1.300766 -1.538931
N  -4.412095 3.125501 -0.461533
C  -3.416783 -1.31872 0.950513
C  -2.333334 -0.879952 -0.066519
C  -1.928786 0.604996 -0.011422
C  -4.82209 -0.804749 0.632448
C  -3.44962 -2.850333 0.928254
C  -3.017125 -0.864505 2.356206
C  0.411204 0.511119 -0.53503
C  -3.426354 2.585597 0.210163
C  0.785518 0.019696 0.710589
C  1.379817 0.68393 -1.52122
C  -4.53161 2.297363 -1.51772
C  3.095879 -0.137865 -0.021248
C  2.114501 -0.299366 0.952005
C  2.699076 0.366685 -1.262278
C  4.502623 -0.495811 0.243631
C  5.547075 0.2819 -0.260001
C  4.821706 -1.625488 0.999744
C  6.868985 -0.060839 -0.017283
C  6.143512 -1.967969 1.242701
C  7.17341 -1.187832 0.734356
H  -1.429154 -1.42658 0.226337
H  -1.67576 0.892164 1.01152
H  -5.537763 -1.275464 1.309285
H  -4.931147 0.271302 0.77119
H  -5.138447 -1.053948 -0.381392
H  -2.470575 -3.275505 1.161583
H  -3.759877 -3.238395 -0.041828
H  -4.154853 -3.225189 1.671978
H  -1.992125 -1.153748 2.603062
H  -3.668276 -1.327752 3.09888
H  -3.10594 0.215018 2.494198
H  -3.268094 -0.690871 -1.763289
H  -3.003473 2.945477 1.134994
H  0.076272 -0.121328 1.514557
H  1.091968 1.060283 -2.494412
H  -5.262156 2.435134 -2.298655
H  2.380624 -0.667621 1.934519
H  3.426441 0.492423 -2.054196
H  5.328141 1.175062 -0.831853
H  4.031206 -2.257389 1.385112
H  7.663089 0.559165 -0.41216
H  6.368428 -2.852519 1.823997
H  8.204574 -1.455762 0.922656
elementType: O N C H
totalener: -1090.77464302 hartree
nucrepener: 2132.99034714 hartree
electener: -3223.76499016 hartree
oneelecener: -5718.53519344 hartree
twoeener: 2494.77020328 hartree
cpcmener: -0.03809530 hartree
kineticenergy: 1086.02280893 hartree
xcener: -106.820112553757 hartree
chargesum: 0.0000000
charge: -0.462404 -0.331931 0.145669 -0.376766 -0.398863 0.260264 0.067649 0.130520 -0.365114 -0.334611 -0.375054 0.316659 0.072237 -0.216468 -0.263593 0.095313 0.115087 -0.233818 -0.155973 0.099002 -0.212371 -0.207974 -0.173712 -0.173748 -0.156795 0.137287 0.141254 0.106419 0.097939 0.099421 0.099270 0.096919 0.095764 0.107998 0.106945 0.097635 0.237426 0.181238 0.147098 0.143156 0.166869 0.147871 0.148123 0.145903 0.147922 0.160679 0.160626 0.163029
qa: -0.4624 -0.3319 0.1457 -0.3768 -0.3989 0.2603 0.0676 0.1305 -0.3651 -0.3346 -0.3751 0.3167 0.0722 -0.2165 -0.2636 0.0953 0.1151 -0.2338 -0.1560 0.0990 -0.2124 -0.2080 -0.1737 -0.1737 -0.1568 0.1373 0.1413 0.1064 0.0979 0.0994 0.0993 0.0969 0.0958 0.1080 0.1069 0.0976 0.2374 0.1812 0.1471 0.1432 0.1669 0.1479 0.1481 0.1459 0.1479 0.1607 0.1606 0.1630
va: 1.9685 2.0781 3.2913 2.8463 3.0235 3.6406 3.8511 3.9788 3.9564 3.9131 3.9438 3.7445 4.0562 3.8990 4.0351 4.0047 3.5536 4.0192 3.9480 3.5164 3.9423 3.9366 3.9129 3.9140 3.8844 0.9991 0.9699 1.0081 0.9979 1.0143 1.0014 1.0191 1.0070 1.0030 1.0054 1.0023 1.0409 0.9920 1.0067 1.0117 0.9922 1.0041 0.9999 1.0059 1.0045 0.9922 0.9923 0.9887
dispcorr: -0.024540475 hartree
energy: -1090.799183497641
dipole: -10.41686 10.77023 0.35337 -13.11575 12.96817 -0.14757 11.96913 -10.09343 1.87570
magnitude: 1.91439 au
magnitude: 4.86600 debye
