program: Orca
programVersion: 4.2.1
elementType: O O N N N C C C C C C C C C C C C C C C C C C C C H H H H H H H H H H H H H H H H H H H H H H H
charge: 0
multiplicity: 1
keywords: wb97x-d3
keywords: def2-TZVPP
keywords: def2/J RIJCOSX GRIDX6 NOFINALGRIDX
keywords: grid4 nofinalgrid
keywords: scfconv7
keywords: smallprint printgap noloewdin
keywords: NOSOSCF
formula: C20H23N3O2
InChI: InChI=1/C20H23N3O2/c1-20(2,3)18(24)19(23-14-21-13-22-23)25-17-11-9-16(10-12-17)15-7-5-4-6-8-15/h4-14,18-19,24H,1-3H3
48 atoms
O  -4.424723 0.882287 0.476258
O  -1.356293 -0.705705 -0.309172
N  -2.059083 1.478008 -0.67667
N  -2.052507 1.438104 -2.010475
N  -1.879872 3.553615 -1.279747
C  -4.004919 -1.523511 0.779472
C  -3.681121 -0.22108 0.003749
C  -2.236012 0.280396 0.121486
C  -3.500682 -2.755121 0.020473
C  -3.42526 -1.505105 2.193543
C  -5.531879 -1.640246 0.872851
C  -0.016343 -0.558307 -0.113518
C  -1.964603 2.739818 -0.257773
C  0.571015 0.468761 0.614709
C  0.784829 -1.535952 -0.696349
C  -1.937891 2.701719 -2.322972
C  2.774026 -0.431824 0.134063
C  1.953318 0.523431 0.72572
C  2.159221 -1.471798 -0.567461
C  4.243618 -0.335655 0.223901
C  5.030799 -1.474533 0.403949
C  4.879828 0.902645 0.113309
C  6.413212 -1.377873 0.46729
C  6.261972 0.999103 0.17528
C  7.034773 -0.141194 0.350813
H  -3.896492 -0.4017 -1.058736
H  -2.047793 0.575814 1.159707
H  -2.417902 -2.852553 0.031266
H  -3.910009 -3.66101 0.470532
H  -3.823264 -2.740376 -1.022656
H  -2.333645 -1.532235 2.198368
H  -3.76182 -2.381019 2.75118
H  -3.743756 -0.623513 2.753355
H  -5.803663 -2.604231 1.30615
H  -6.008384 -1.585865 -0.110415
H  -5.974629 -0.871789 1.508262
H  -5.315519 0.825789 0.118657
H  -1.961116 3.018351 0.784647
H  -0.008243 1.233775 1.111353
H  0.327564 -2.338816 -1.260963
H  -1.888007 3.026873 -3.350145
H  2.388887 1.330393 1.301258
H  2.763165 -2.231329 -1.047652
H  4.559653 -2.443874 0.513313
H  4.29104 1.797391 -0.047545
H  7.006029 -2.271371 0.613487
H  6.735786 1.967101 0.074937
H  8.113274 -0.066796 0.394526
elementType: O N C H
totalener: -1090.77437273 hartree
nucrepener: 2141.43222976 hartree
electener: -3232.20660249 hartree
oneelecener: -5736.06002177 hartree
twoeener: 2503.85341929 hartree
cpcmener: -0.03713452 hartree
kineticenergy: 1086.02643239 hartree
xcener: -106.814618175851 hartree
chargesum: -0.0000000
charge: -0.409224 -0.307854 0.129445 -0.371417 -0.413115 0.239658 0.034459 0.140493 -0.335120 -0.370933 -0.351633 0.316678 0.068040 -0.191737 -0.258190 0.072649 0.117963 -0.225038 -0.157964 0.101230 -0.214739 -0.209349 -0.173326 -0.175208 -0.154659 0.114744 0.151728 0.098700 0.096828 0.097309 0.091156 0.102871 0.104232 0.093520 0.108655 0.095669 0.232750 0.184113 0.139950 0.144064 0.165831 0.149749 0.148919 0.147413 0.147981 0.160214 0.160485 0.162009
qa: -0.4092 -0.3079 0.1294 -0.3714 -0.4131 0.2397 0.0345 0.1405 -0.3351 -0.3709 -0.3516 0.3167 0.0680 -0.1917 -0.2582 0.0726 0.1180 -0.2250 -0.1580 0.1012 -0.2147 -0.2093 -0.1733 -0.1752 -0.1547 0.1147 0.1517 0.0987 0.0968 0.0973 0.0912 0.1029 0.1042 0.0935 0.1087 0.0957 0.2328 0.1841 0.1400 0.1441 0.1658 0.1497 0.1489 0.1474 0.1480 0.1602 0.1605 0.1620
va: 2.0131 2.0930 3.2974 2.8870 3.0374 3.6587 4.0000 3.8835 3.9361 3.9403 3.9299 3.6845 4.0781 3.9401 4.0419 4.0388 3.5473 4.0195 3.9502 3.5088 3.9424 3.9362 3.9136 3.9159 3.8831 1.0113 0.9774 1.0071 1.0035 1.0057 1.0030 1.0052 1.0133 1.0071 1.0001 1.0130 1.0033 0.9911 1.0166 1.0089 0.9931 1.0021 1.0007 1.0051 1.0042 0.9922 0.9922 0.9891
dispcorr: -0.024100678 hartree
energy: -1090.798473408112
dipole: -15.57729 14.92533 -0.65197 -14.01371 12.93050 -1.08320 8.90500 -7.79046 1.11454
magnitude: 1.68541 au
magnitude: 4.28397 debye
