program: Orca
programVersion: 5.0.4
elementType: C C C C C N C C C C H C N C C H C O C O N N C H H H C H H H C H H H C H H H Tm N O O O N O O O N O O O H H C F F F C F F F
elementType: Tm
keywords: def2-SVPD def2/JK def2/J def2-SVPD/C PBE rijcosx rhf hcore XYZFile VeryTightSCF freq cpcm(water) D3 defgrid3
charge: 0
multiplicity: 1
frequency: 0.00 0.00 0.00 0.00 0.00 0.00 17.26 22.18 28.92 29.07 33.67 35.91 42.93 51.44 54.15 57.28 65.33 73.56 78.08 81.43 86.32 88.33 90.65 101.88 108.60 114.53 117.87 119.43 135.80 136.90 146.26 148.15 154.24 159.86 167.89 172.75 176.10 178.41 183.63 187.23 190.66 194.54 197.04 201.99 210.68 211.85 221.03 234.32 245.09 255.65 261.75 264.10 280.63 296.54 306.06 310.93 329.16 351.24 366.07 372.99 404.52 428.53 431.76 445.95 452.54 465.53 479.48 493.83 511.68 518.21 528.95 542.73 567.01 584.40 621.10 622.47 636.19 652.87 664.90 694.01 697.59 700.57 702.23 703.31 705.66 710.32 726.21 736.93 737.07 739.54 744.88 750.49 794.22 796.77 797.37 799.20 823.39 829.69 833.52 838.14 846.77 903.98 935.15 970.20 971.52 974.12 976.71 1033.75 1042.89 1046.14 1047.90 1056.92 1058.56 1060.25 1071.50 1071.59 1072.87 1081.01 1082.93 1106.27 1116.73 1119.45 1130.90 1140.11 1159.95 1164.93 1205.84 1211.12 1220.53 1241.86 1254.74 1273.59 1279.23 1282.28 1290.73 1298.99 1350.08 1361.85 1367.43 1375.68 1377.15 1381.86 1383.75 1394.59 1395.24 1397.36 1398.71 1407.13 1410.74 1410.91 1415.34 1420.82 1423.63 1458.05 1467.44 1468.61 1473.89 1478.95 1492.76 1495.05 1512.38 1564.42 1589.37 1597.96 1610.17 1619.88 1625.88 2978.55 2978.58 2982.81 2982.91 3063.92 3064.68 3068.54 3068.96 3112.36 3113.17 3121.17 3121.33 3166.45 3174.42 3175.75 3183.27
frequency: 17.26 22.18 28.92 29.07 33.67 35.91 42.93 51.44 54.15 57.28 65.33 73.56 78.08 81.43 86.32 88.33 90.65 101.88 108.60 114.53 117.87 119.43 135.80 136.90 146.26 148.15 154.24 159.86 167.89 172.75 176.10 178.41 183.63 187.23 190.66 194.54 197.04 201.99 210.68 211.85 221.03 234.32 245.09 255.65 261.75 264.10 280.63 296.54 306.06 310.93 329.16 351.24 366.07 372.99 404.52 428.53 431.76 445.95 452.54 465.53 479.48 493.83 511.68 518.21 528.95 542.73 567.01 584.40 621.10 622.47 636.19 652.87 664.90 694.01 697.59 700.57 702.23 703.31 705.66 710.32 726.21 736.93 737.07 739.54 744.88 750.49 794.22 796.77 797.37 799.20 823.39 829.69 833.52 838.14 846.77 903.98 935.15 970.20 971.52 974.12 976.71 1033.75 1042.89 1046.14 1047.90 1056.92 1058.56 1060.25 1071.50 1071.59 1072.87 1081.01 1082.93 1106.27 1116.73 1119.45 1130.90 1140.11 1159.95 1164.93 1205.84 1211.12 1220.53 1241.86 1254.74 1273.59 1279.23 1282.28 1290.73 1298.99 1350.08 1361.85 1367.43 1375.68 1377.15 1381.86 1383.75 1394.59 1395.24 1397.36 1398.71 1407.13 1410.74 1410.91 1415.34 1420.82 1423.63 1458.05 1467.44 1468.61 1473.89 1478.95 1492.76 1495.05 1512.38 1564.42 1589.37 1597.96 1610.17 1619.88 1625.88 2978.55 2978.58 2982.81 2982.91 3063.92 3064.68 3068.54 3068.96 3112.36 3113.17 3121.17 3121.33 3166.45 3174.42 3175.75 3183.27
formula: C20H16F6N7O11Tm
InChI: InChI=1/C20H16F6N4O2.3NO3.Tm/c1-29(2)17(31)11-7-5-9-13(19(21,22)23)14(20(24,25)26)10-6-8-12(18(32)30(3)4)28-16(10)15(9)27-11;3*2-1(3)4;/h5-8H,1-4H3;;;;/q-4;3*-2;+10/rC20H16F6N7O11Tm/c1-27(2)17-11-7-5-9-13(19(21,22)23)14(20(24,25)26)10-6-8-12-18(28(3)4)38-45(37-17,39-31(34)40-45,41-32(35)42-45,43-33(36)44-45)29(11)15(9)16(10)30(12)45/h5-8H,1-4H3
61 atoms
C  -2.316873 -2.96063 -2.816022
C  -1.503363 -2.014835 -3.428849
C  -2.462998 -2.967537 -1.402126
C  -0.865806 -1.033855 -2.636574
C  -1.700354 -2.002308 -0.687591
N  -0.963462 -1.055657 -1.303124
C  -3.243911 -3.937385 -0.653639
C  -3.033096 -4.101189 0.711708
C  -2.270775 -3.116317 1.460999
C  -1.643969 -2.048948 0.755312
H  -1.341893 -2.062248 -4.510551
C  -2.120011 -3.098533 2.874763
N  -0.92615 -1.089455 1.367547
C  -0.806124 -1.074575 2.697571
C  -1.393103 -2.086512 3.490945
H  -1.263854 -2.108707 4.57691
C  0.11612 0.011421 -3.113863
O  1.016976 0.346955 -2.289505
C  0.10211 0.042349 3.159299
O  0.917156 0.485469 2.297516
N  0.049352 0.535233 -4.344295
N  0.065786 0.531312 4.406297
C  -1.095889 0.429381 -5.247376
H  -0.888589 -0.282811 -6.068941
H  -2.004437 0.131462 -4.702958
H  -1.272277 1.428046 -5.684661
C  1.114188 1.435251 -4.784602
H  2.036184 1.227776 -4.221367
H  1.282138 1.272691 -5.863425
H  0.812121 2.488506 -4.622832
C  -1.005152 0.305915 5.376859
H  -1.936022 -0.000303 4.876033
H  -0.707387 -0.447109 6.131635
H  -1.195784 1.262816 5.89342
C  1.086311 1.49847 4.810699
H  0.697552 2.53008 4.704996
H  1.334913 1.315905 5.87087
H  1.983267 1.378844 4.185099
Tm 0.378512 0.608064 -0.006195
N  2.75859 -1.055523 0.094104
O  3.768991 -1.75853 0.137997
O  2.818934 0.221225 0.084642
O  1.584356 -1.56061 0.054667
N  -2.179292 1.890706 -0.690416
O  -3.230188 2.459764 -0.991472
O  -1.134849 1.969136 -1.427976
O  -2.064816 1.18733 0.366252
N  0.990228 3.458351 0.289045
O  1.243561 4.661893 0.376961
O  0.094211 2.89959 1.006095
O  1.61078 2.694626 -0.52863
H  -2.575001 -3.868168 3.50488
H  -2.795391 -3.723822 -3.43802
C  -3.520815 -5.329726 1.484589
F  -4.613444 -5.059652 2.244621
F  -3.809228 -6.384737 0.695364
F  -2.542272 -5.766997 2.325403
C  -4.339615 -4.686908 -1.420177
F  -4.844152 -3.899466 -2.40783
F  -3.896316 -5.826118 -2.007906
F  -5.396173 -4.995956 -0.633619
elementType: C N H O Tm F
totalener: -2616.04683663 hartree
nucrepener: 6517.79463282 hartree
electener: -9133.84146945 hartree
twoeener: 7458.46611830 hartree
cpcmener: -0.09044610 hartree
kineticenergy: 2566.70309242 hartree
exchangeener: -310.033650308407 hartree
correlationener: -11.662892140198 hartree
xcener: -321.696542448605 hartree
chargesum: 0.0000000
charge: 0.060984 -0.598003 -0.440378 -0.231396 -0.130746 0.173878 -0.651169 -0.599018 -0.514643 0.195614 0.154556 -0.063919 -0.239791 -0.099700 -0.540827 0.096067 0.808780 -0.870355 0.915587 -1.051766 -1.407191 -1.333628 0.907389 0.120872 0.004403 -0.173291 1.047275 -0.115748 -0.075147 0.057558 0.864816 0.031456 0.144573 -0.221166 1.017042 0.042329 -0.043259 -0.114722 2.844596 0.562128 -0.438264 -0.555140 -0.523652 0.541219 -0.449708 -0.510357 -0.503178 0.560975 -0.450529 -0.540068 -0.538498 1.139326 1.234421 1.599520 -0.425194 -0.449702 -0.473028 1.583613 -0.464152 -0.430333 -0.441312
charge: 0.126278 0.121294 -0.007525 0.004913 0.011844 -0.030267 0.057893 0.056864 -0.003575 0.007738 0.035689 0.126278 -0.039749 0.009968 0.123077 0.029169 -0.035966 -0.295875 -0.006556 -0.298460 -0.195410 -0.197495 0.245245 0.027318 0.007686 0.023001 0.253166 0.004716 0.023159 0.032054 0.244301 0.008605 0.027568 0.021966 0.251778 0.031405 0.023569 0.004471 1.502418 -0.365515 -0.037461 -0.167243 -0.165224 -0.360193 -0.039938 -0.159109 -0.161992 -0.367710 -0.044134 -0.152504 -0.165636 0.031862 0.038672 0.053215 -0.050865 -0.051881 -0.056340 0.052043 -0.056725 -0.052913 -0.052964
qa: 0.0610 -0.5980 -0.4404 -0.2314 -0.1307 0.1739 -0.6512 -0.5990 -0.5146 0.1956 0.1546 -0.0639 -0.2398 -0.0997 -0.5408 0.0961 0.8088 -0.8704 0.9156 -1.0518 -1.4072 -1.3336 0.9074 0.1209 0.0044 -0.1733 1.0473 -0.1157 -0.0751 0.0576 0.8648 0.0315 0.1446 -0.2212 1.0170 0.0423 -0.0433 -0.1147 2.8446 0.5621 -0.4383 -0.5551 -0.5237 0.5412 -0.4497 -0.5104 -0.5032 0.5610 -0.4505 -0.5401 -0.5385 1.1393 1.2344 1.5995 -0.4252 -0.4497 -0.4730 1.5836 -0.4642 -0.4303 -0.4413
va: 3.5861 4.5265 4.2876 4.4186 4.7647 4.9833 4.8757 5.2454 4.7411 4.4510 1.6495 3.5384 5.2596 4.2491 4.5746 1.7006 3.2044 1.5596 2.8488 1.6523 5.5252 5.4098 3.7727 0.8240 1.0322 0.9442 3.5926 1.1046 0.9031 0.8437 3.8100 0.9921 0.8193 0.9792 3.5959 0.8650 0.9048 1.1198 0.0633 4.0566 1.7800 1.4311 1.3918 4.1154 1.7829 1.1980 1.4381 4.0611 1.7784 1.3302 1.3942 -0.0088 -0.2455 3.1508 0.7856 0.7405 0.8793 3.0257 0.8444 0.7805 0.7463
dispersion: -0.092917566 hartree
energy: -2616.139754198843 hartree
dipole: -145.78409 142.05239 -3.73170 -162.20124 157.17285 -5.02839 0.30630 0.19588 0.50218
magnitude: 6.28192 au
magnitude: 15.96736 debye
temp: 298.15 k
press: 1.00 atm
zeropoint: 0.38489220 hartree
thermalvibcorrection: 0.04159030 hartree
thermalrotcorrection: 0.00141627 hartree
thermaltrasncorrection: 0.00141627 hartree
thermaltotal: -2615.71043915 hartree
thermalcorr: 0.04442285 hartree
nonthermalcorr: 0.38489220 hartree
totalcorr: 0.42931504 hartree
thermalcorrenthalpy: 0.00094421 hartree
totalenthalpy: -2615.70949495 hartree
vibrat: 0.07671845 hartree
rotat: 0.01829526 hartree
transl: 0.02183966 hartree
total: 0.11685338 hartree
totalentropycorr: -0.11685338 hartree
gibbsenthalpy: -2615.82634832 hartree
gibbsminuselec: 0.31340588 hartree
