program: Orca
programVersion: 5.0.4
elementType: C C C C C N C C C C H C N C C H C O C O N N C H H H C H H H C H H H C H H H Dy N O O O N O O O N O O O H H C F F F C F F F
elementType: Dy
keywords: def2-SVPD def2/JK def2/J def2-SVPD/C PBE rijcosx rhf hcore XYZFile VeryTightSCF freq cpcm(water) D3 defgrid3
charge: 0
multiplicity: 1
frequency: 0.00 0.00 0.00 0.00 0.00 0.00 15.51 22.38 27.79 29.79 33.42 34.93 41.21 49.39 52.67 54.10 65.35 76.54 76.78 81.00 85.65 88.96 90.57 101.09 101.67 110.38 114.62 117.59 130.22 135.63 139.12 144.11 154.69 162.57 165.84 171.65 174.42 177.96 181.88 186.26 188.64 192.83 195.92 201.22 208.18 211.03 220.14 233.68 241.99 253.51 260.43 263.85 279.41 295.28 306.01 310.43 328.82 350.40 365.46 372.53 403.06 426.90 430.01 444.77 449.71 463.47 477.16 492.52 509.26 516.67 528.66 542.37 567.67 582.55 621.37 623.40 635.72 652.42 664.21 693.76 697.47 701.41 703.01 703.77 705.76 709.92 726.03 735.33 736.85 737.75 742.91 750.72 793.52 797.44 797.93 799.38 822.81 828.87 833.46 838.25 847.07 903.46 934.57 969.92 971.03 973.66 977.21 1033.97 1042.77 1045.04 1046.99 1055.03 1057.00 1058.73 1071.42 1071.73 1072.82 1080.58 1082.65 1105.16 1117.08 1119.69 1129.88 1139.47 1159.20 1164.58 1205.36 1210.97 1220.41 1241.36 1254.48 1272.92 1277.61 1279.52 1286.69 1294.55 1349.95 1361.06 1366.93 1375.59 1376.84 1381.87 1383.53 1394.82 1394.91 1396.85 1398.06 1405.60 1410.69 1411.13 1414.14 1419.82 1422.69 1457.34 1466.71 1467.81 1473.92 1477.91 1492.87 1493.86 1512.32 1563.48 1588.63 1598.19 1609.86 1618.54 1624.71 2978.55 2978.99 2982.74 2983.44 3063.52 3064.86 3068.02 3068.87 3113.51 3113.78 3121.29 3121.68 3165.55 3173.26 3174.99 3182.57
frequency: 15.51 22.38 27.79 29.79 33.42 34.93 41.21 49.39 52.67 54.10 65.35 76.54 76.78 81.00 85.65 88.96 90.57 101.09 101.67 110.38 114.62 117.59 130.22 135.63 139.12 144.11 154.69 162.57 165.84 171.65 174.42 177.96 181.88 186.26 188.64 192.83 195.92 201.22 208.18 211.03 220.14 233.68 241.99 253.51 260.43 263.85 279.41 295.28 306.01 310.43 328.82 350.40 365.46 372.53 403.06 426.90 430.01 444.77 449.71 463.47 477.16 492.52 509.26 516.67 528.66 542.37 567.67 582.55 621.37 623.40 635.72 652.42 664.21 693.76 697.47 701.41 703.01 703.77 705.76 709.92 726.03 735.33 736.85 737.75 742.91 750.72 793.52 797.44 797.93 799.38 822.81 828.87 833.46 838.25 847.07 903.46 934.57 969.92 971.03 973.66 977.21 1033.97 1042.77 1045.04 1046.99 1055.03 1057.00 1058.73 1071.42 1071.73 1072.82 1080.58 1082.65 1105.16 1117.08 1119.69 1129.88 1139.47 1159.20 1164.58 1205.36 1210.97 1220.41 1241.36 1254.48 1272.92 1277.61 1279.52 1286.69 1294.55 1349.95 1361.06 1366.93 1375.59 1376.84 1381.87 1383.53 1394.82 1394.91 1396.85 1398.06 1405.60 1410.69 1411.13 1414.14 1419.82 1422.69 1457.34 1466.71 1467.81 1473.92 1477.91 1492.87 1493.86 1512.32 1563.48 1588.63 1598.19 1609.86 1618.54 1624.71 2978.55 2978.99 2982.74 2983.44 3063.52 3064.86 3068.02 3068.87 3113.51 3113.78 3121.29 3121.68 3165.55 3173.26 3174.99 3182.57
formula: C20H16DyF6N7O11
InChI: InChI=1/C20H16F6N4O2.Dy.3NO3/c1-29(2)17(31)11-7-5-9-13(19(21,22)23)14(20(24,25)26)10-6-8-12(18(32)30(3)4)28-16(10)15(9)27-11;;3*2-1(3)4/h5-8H,1-4H3;;;;/q-4;+10;3*-2/rC20H16DyF6N7O11/c1-28(2)17-11-7-5-9-13(19(22,23)24)14(20(25,26)27)10-6-8-12-18(29(3)4)39-21(38-17,40-32(35)41-21,42-33(36)43-21,44-34(37)45-21)30(11)15(9)16(10)31(12)21/h5-8H,1-4H3
61 atoms
C  -2.319396 -2.96888 -2.816387
C  -1.509644 -2.022522 -3.432531
C  -2.456269 -2.978015 -1.401626
C  -0.864978 -1.045496 -2.641541
C  -1.687648 -2.015549 -0.688467
N  -0.951462 -1.069838 -1.307241
C  -3.235772 -3.948882 -0.653527
C  -3.020201 -4.116608 0.710255
C  -2.257495 -3.132275 1.459338
C  -1.629816 -2.063564 0.755264
H  -1.356188 -2.064839 -4.515794
C  -2.109858 -3.11742 2.873414
N  -0.915624 -1.103023 1.371289
C  -0.804578 -1.088521 2.702285
C  -1.389674 -2.103215 3.493107
H  -1.263426 -2.124025 4.579682
C  0.111736 -0.001084 -3.131628
O  1.041158 0.314037 -2.33133
C  0.091189 0.031965 3.178917
O  0.933679 0.467115 2.33958
N  0.006474 0.544754 -4.349728
N  0.012621 0.533556 4.418866
C  -1.167497 0.455943 -5.217193
H  -0.985071 -0.237942 -6.060011
H  -2.05705 0.143141 -4.650324
H  -1.360294 1.463401 -5.626585
C  1.058128 1.450322 -4.809512
H  1.995094 1.238349 -4.273373
H  1.197259 1.299426 -5.894167
H  0.7590 2.501305 -4.628644
C  -1.09044 0.318399 5.355233
H  -1.998657 -0.012874 4.829609
H  -0.810598 -0.411954 6.138497
H  -1.311391 1.285302 5.840394
C  1.016893 1.507377 4.847079
H  0.630341 2.536849 4.715664
H  1.228647 1.337743 5.917304
H  1.935254 1.382214 4.254449
Dy 0.438513 0.609754 -0.006386
N  2.817823 -1.1083 0.115303
O  3.818159 -1.824303 0.171665
O  2.898253 0.168412 0.102769
O  1.637823 -1.598905 0.06539
N  -2.125539 1.948721 -0.659194
O  -3.170468 2.540977 -0.934493
O  -1.105017 1.989037 -1.432134
O  -1.997012 1.258675 0.405829
N  1.138065 3.480924 0.217678
O  1.416522 4.680644 0.280468
O  0.249842 2.952913 0.968724
O  1.722077 2.694393 -0.604342
H  -2.564013 -3.889919 3.500652
H  -2.803283 -3.730279 -3.436423
C  -3.503446 -5.348538 1.480524
F  -4.595545 -5.084299 2.243247
F  -3.79003 -6.401719 0.687976
F  -2.522247 -5.785746 2.318221
C  -4.335729 -4.694349 -1.417845
F  -4.847493 -3.90046 -2.39672
F  -3.895365 -5.829051 -2.01635
F  -5.386835 -5.009823 -0.626625
elementType: C N H O Dy F
totalener: -2614.29936659 hartree
nucrepener: 6491.04217159 hartree
electener: -9105.34153818 hartree
twoeener: 7430.47327020 hartree
cpcmener: -0.09050399 hartree
kineticenergy: 2565.79077904 hartree
exchangeener: -309.845774773478 hartree
correlationener: -11.655962267964 hartree
xcener: -321.501737041442 hartree
chargesum: -0.0000000
charge: 0.068402 -0.574780 -0.407230 -0.245017 -0.195967 0.144768 -0.643774 -0.584328 -0.490857 0.155042 0.132049 -0.043467 -0.240409 -0.151133 -0.513319 0.084656 0.810209 -0.963333 0.892753 -1.097260 -1.413785 -1.328876 0.912447 0.111581 0.004540 -0.166044 1.049011 -0.111725 -0.070821 0.057199 0.875488 0.019808 0.132468 -0.210895 1.006077 0.045591 -0.041419 -0.107497 3.223606 0.550971 -0.435649 -0.585101 -0.570438 0.534572 -0.445048 -0.525291 -0.517865 0.552595 -0.447681 -0.556538 -0.529765 1.135959 1.219287 1.593954 -0.424714 -0.448994 -0.472801 1.584750 -0.464854 -0.430040 -0.441066
charge: 0.125191 0.119562 -0.008720 0.001891 0.012006 -0.030185 0.056991 0.056068 -0.004806 0.008295 0.036626 0.125404 -0.037844 0.006546 0.121151 0.030582 -0.039477 -0.299614 -0.009849 -0.303087 -0.196422 -0.198522 0.244648 0.026997 0.007341 0.022860 0.252168 0.004090 0.022920 0.031427 0.243744 0.008009 0.027370 0.022096 0.250639 0.031037 0.023254 0.004090 1.564934 -0.367657 -0.038273 -0.169365 -0.167931 -0.361658 -0.040729 -0.161590 -0.166036 -0.370649 -0.046499 -0.156750 -0.165773 0.031746 0.038424 0.053033 -0.050895 -0.051865 -0.056375 0.051929 -0.056736 -0.052843 -0.052923
qa: 0.0684 -0.5748 -0.4072 -0.2450 -0.1960 0.1448 -0.6438 -0.5843 -0.4909 0.1550 0.1320 -0.0435 -0.2404 -0.1511 -0.5133 0.0847 0.8102 -0.9633 0.8928 -1.0973 -1.4138 -1.3289 0.9124 0.1116 0.0045 -0.1660 1.0490 -0.1117 -0.0708 0.0572 0.8755 0.0198 0.1325 -0.2109 1.0061 0.0456 -0.0414 -0.1075 3.2236 0.5510 -0.4356 -0.5851 -0.5704 0.5346 -0.4450 -0.5253 -0.5179 0.5526 -0.4477 -0.5565 -0.5298 1.1360 1.2193 1.5940 -0.4247 -0.4490 -0.4728 1.5847 -0.4649 -0.4300 -0.4411
va: 3.6285 4.5265 4.2197 4.5034 4.9198 4.9399 4.8933 5.2634 4.6646 4.5517 1.6404 3.5683 5.2266 4.3991 4.5725 1.6707 3.2148 1.5173 2.9231 1.6600 5.5323 5.4282 3.7699 0.8309 1.0331 0.9357 3.5904 1.1103 0.9027 0.8487 3.8051 1.0080 0.8241 0.9675 3.6062 0.8658 0.9116 1.1188 -0.8776 4.0610 1.7844 1.4381 1.5017 4.1188 1.7852 1.2159 1.4936 4.0717 1.7733 1.3555 1.3931 0.0081 -0.2035 3.1585 0.7851 0.7401 0.8796 3.0257 0.8485 0.7802 0.7451
dispersion: -0.093569427 hartree
energy: -2614.392936020315 hartree
dipole: -144.85884 140.77889 -4.07995 -155.13145 150.11894 -5.01251 0.24969 0.28430 0.53399
magnitude: 6.48509 au
magnitude: 16.48379 debye
temp: 298.15 k
press: 1.00 atm
zeropoint: 0.38456511 hartree
thermalvibcorrection: 0.04173689 hartree
thermalrotcorrection: 0.00141627 hartree
thermaltrasncorrection: 0.00141627 hartree
thermaltotal: -2613.96380148 hartree
thermalcorr: 0.04456943 hartree
nonthermalcorr: 0.38456511 hartree
totalcorr: 0.42913454 hartree
thermalcorrenthalpy: 0.00094421 hartree
totalenthalpy: -2613.96285727 hartree
vibrat: 0.07714873 hartree
rotat: 0.01830602 hartree
transl: 0.02182841 hartree
total: 0.11728316 hartree
totalentropycorr: -0.11728316 hartree
gibbsenthalpy: -2614.08014042 hartree
gibbsminuselec: 0.31279560 hartree
