program: Orca
programVersion: 4.2.1
elementType: O O N N N C C C C C C C C C C C C C C C C C C C C H H H H H H H H H H H H H H H H H H H H H H H
charge: 0
multiplicity: 1
keywords: wb97x-d3
keywords: def2-TZVPP
keywords: def2/J RIJCOSX GRIDX6 NOFINALGRIDX
keywords: grid4 nofinalgrid
keywords: scfconv7
keywords: smallprint printgap noloewdin
keywords: NOSOSCF
formula: C20H23N3O2
InChI: InChI=1/C20H23N3O2/c1-20(2,3)18(24)19(23-14-21-13-22-23)25-17-11-9-16(10-12-17)15-7-5-4-6-8-15/h4-14,18-19,24H,1-3H3
48 atoms
O  -3.56361 -1.295957 -1.401892
O  -1.058596 -1.143515 -0.376071
N  -2.059723 0.955249 -0.219256
N  -2.037676 1.993375 0.624808
N  -2.142903 2.70856 -1.496741
C  -4.649972 -0.623368 0.632793
C  -3.363776 -1.174635 -0.014989
C  -2.063367 -0.406709 0.27125
C  -4.419396 -0.386061 2.126014
C  -5.168134 0.66342 -0.015601
C  -5.726606 -1.704351 0.477337
C  0.257713 -0.849574 -0.186141
C  -2.122885 1.397764 -1.478877
C  1.144167 -1.523953 -1.020841
C  0.746259 0.037939 0.763732
C  -2.096423 3.017648 -0.185429
C  3.021065 -0.416946 0.036291
C  2.503733 -1.310168 -0.905482
C  2.116121 0.243175 0.863475
C  4.47396 -0.177482 0.139885
C  5.078547 0.061722 1.375735
C  5.279816 -0.181394 -1.000912
C  6.443242 0.292395 1.467094
C  6.644805 0.045754 -0.909366
C  7.233135 0.285078 0.325189
H  -3.191977 -2.161669 0.439196
H  -1.893541 -0.349239 1.34858
H  -5.366009 -0.151553 2.615936
H  -4.008765 -1.269954 2.619949
H  -3.747024 0.450967 2.319783
H  -6.148022 0.904085 0.401984
H  -5.295227 0.562505 -1.093462
H  -4.5324 1.527354 0.174936
H  -5.418645 -2.647269 0.935169
H  -5.96175 -1.901824 -0.568601
H  -6.650215 -1.389224 0.965907
H  -2.909442 -1.907089 -1.756776
H  -2.137167 0.754397 -2.342153
H  0.76347 -2.223547 -1.753942
H  0.094679 0.588687 1.427476
H  -2.097502 4.030852 0.184063
H  3.171415 -1.862531 -1.554218
H  2.472031 0.957632 1.594697
H  4.482816 0.050109 2.279966
H  4.836027 -0.34426 -1.975074
H  6.891535 0.471107 2.43567
H  7.248263 0.044181 -1.807689
H  8.297773 0.464237 0.396471
elementType: O N C H
totalener: -1090.77643779 hartree
nucrepener: 2142.67014668 hartree
electener: -3233.44658446 hartree
oneelecener: -5738.12207136 hartree
twoeener: 2504.67548690 hartree
cpcmener: -0.03238415 hartree
kineticenergy: 1086.00653198 hartree
xcener: -106.813591244379 hartree
chargesum: 0.0000000
charge: -0.418331 -0.321905 0.125156 -0.357409 -0.395441 0.219114 0.148090 0.066582 -0.350708 -0.367134 -0.341837 0.283042 0.070872 -0.247638 -0.193830 0.080610 0.113998 -0.158659 -0.209172 0.097052 -0.206943 -0.212159 -0.174047 -0.172575 -0.154655 0.117670 0.154823 0.101456 0.108612 0.087867 0.107612 0.105481 0.094572 0.096710 0.098297 0.095908 0.230272 0.168718 0.142900 0.135142 0.163188 0.147343 0.145926 0.146030 0.145402 0.161020 0.160342 0.162636
qa: -0.4183 -0.3219 0.1252 -0.3574 -0.3954 0.2191 0.1481 0.0666 -0.3507 -0.3671 -0.3418 0.2830 0.0709 -0.2476 -0.1938 0.0806 0.1140 -0.1587 -0.2092 0.0971 -0.2069 -0.2122 -0.1740 -0.1726 -0.1547 0.1177 0.1548 0.1015 0.1086 0.0879 0.1076 0.1055 0.0946 0.0967 0.0983 0.0959 0.2303 0.1687 0.1429 0.1351 0.1632 0.1473 0.1459 0.1460 0.1454 0.1610 0.1603 0.1626
va: 2.0201 2.0723 3.2582 2.8311 3.0559 3.7139 3.9120 3.9738 3.9362 3.9391 3.9120 3.7562 4.0738 4.0254 3.9153 4.0110 3.5638 3.9484 4.0094 3.5298 3.9376 3.9432 3.9124 3.9128 3.8832 1.0026 0.9813 1.0061 1.0037 1.0164 1.0078 1.0161 1.0052 1.0049 1.0164 1.0063 1.0087 1.0196 1.0102 1.0297 0.9950 1.0006 1.0042 1.0051 1.0054 0.9919 0.9923 0.9889
dispcorr: -0.024717774 hartree
energy: -1090.801155561013
dipole: -19.99571 20.25056 0.25484 -5.21521 3.60773 -1.60748 7.01133 -6.31070 0.70063
magnitude: 1.77195 au
magnitude: 4.50394 debye
