program: Orca
programVersion: 5.0.4
elementType: C C C C C N C C C C H C N C C H C O C O N N C H H H C H H H C H H H C H H H La N O O O N O O O N O O O H H C F F F C F F F
elementType: La
keywords: def2-SVPD def2/JK def2/J def2-SVPD/C PBE rijcosx rhf hcore XYZFile VeryTightSCF freq cpcm(water) D3 defgrid3
charge: 0
multiplicity: 1
frequency: 0.00 0.00 0.00 0.00 0.00 0.00 12.09 21.95 24.10 30.94 33.31 34.11 36.17 38.35 40.17 50.13 59.66 63.52 65.57 68.12 77.45 80.81 85.11 88.21 90.48 94.63 100.91 104.05 106.14 111.90 119.16 126.50 133.37 150.27 155.90 166.02 167.40 171.37 177.37 180.79 189.96 194.06 199.09 200.76 207.58 209.20 218.06 230.31 233.80 246.04 258.95 262.94 279.45 291.15 305.43 309.06 327.52 350.09 362.85 371.47 398.52 420.98 424.71 438.16 440.01 455.11 468.96 486.85 502.08 511.57 528.04 540.82 570.64 576.98 622.79 627.77 633.65 650.47 662.28 693.73 697.55 703.20 704.28 705.17 706.32 707.85 725.93 727.73 730.86 735.01 737.84 752.47 790.48 798.30 799.68 800.22 820.61 822.31 833.68 839.29 848.55 901.19 933.44 967.79 971.08 971.81 979.55 1035.88 1041.09 1044.45 1044.61 1049.70 1052.31 1053.73 1070.95 1071.33 1072.91 1079.48 1081.71 1103.18 1118.59 1120.26 1127.57 1139.58 1160.11 1164.18 1204.08 1212.60 1222.28 1241.04 1255.32 1264.46 1271.65 1272.75 1279.49 1280.41 1349.65 1357.68 1365.40 1375.54 1376.67 1381.06 1382.64 1393.43 1394.67 1395.44 1396.42 1399.76 1409.47 1410.90 1411.61 1418.92 1420.07 1455.28 1461.00 1469.29 1470.23 1476.26 1489.48 1495.39 1511.90 1560.02 1586.21 1599.49 1609.23 1616.49 1622.92 2978.30 2978.92 2981.93 2982.50 3061.83 3063.04 3067.10 3067.97 3112.79 3113.40 3121.15 3122.68 3159.40 3163.30 3175.24 3179.68
frequency: 12.09 21.95 24.10 30.94 33.31 34.11 36.17 38.35 40.17 50.13 59.66 63.52 65.57 68.12 77.45 80.81 85.11 88.21 90.48 94.63 100.91 104.05 106.14 111.90 119.16 126.50 133.37 150.27 155.90 166.02 167.40 171.37 177.37 180.79 189.96 194.06 199.09 200.76 207.58 209.20 218.06 230.31 233.80 246.04 258.95 262.94 279.45 291.15 305.43 309.06 327.52 350.09 362.85 371.47 398.52 420.98 424.71 438.16 440.01 455.11 468.96 486.85 502.08 511.57 528.04 540.82 570.64 576.98 622.79 627.77 633.65 650.47 662.28 693.73 697.55 703.20 704.28 705.17 706.32 707.85 725.93 727.73 730.86 735.01 737.84 752.47 790.48 798.30 799.68 800.22 820.61 822.31 833.68 839.29 848.55 901.19 933.44 967.79 971.08 971.81 979.55 1035.88 1041.09 1044.45 1044.61 1049.70 1052.31 1053.73 1070.95 1071.33 1072.91 1079.48 1081.71 1103.18 1118.59 1120.26 1127.57 1139.58 1160.11 1164.18 1204.08 1212.60 1222.28 1241.04 1255.32 1264.46 1271.65 1272.75 1279.49 1280.41 1349.65 1357.68 1365.40 1375.54 1376.67 1381.06 1382.64 1393.43 1394.67 1395.44 1396.42 1399.76 1409.47 1410.90 1411.61 1418.92 1420.07 1455.28 1461.00 1469.29 1470.23 1476.26 1489.48 1495.39 1511.90 1560.02 1586.21 1599.49 1609.23 1616.49 1622.92 2978.30 2978.92 2981.93 2982.50 3061.83 3063.04 3067.10 3067.97 3112.79 3113.40 3121.15 3122.68 3159.40 3163.30 3175.24 3179.68
formula: C20H16F6LaN7O11
InChI: InChI=1/C20H16F6N4O2.La.3NO3/c1-29(2)17(31)11-7-5-9-13(19(21,22)23)14(20(24,25)26)10-6-8-12(18(32)30(3)4)28-16(10)15(9)27-11;;3*2-1(3)4/h5-8H,1-4H3;;;;/q-3;+9;3*-2/rC20H16F6LaN7O11/c1-29(2)17-11-7-5-9-13(19(21,22)23)14(20(24,25)26)10-6-8-12-18(30(3)4)39-27(38-17,40-32(35)41-27,42-33(36)43-27,44-34(37)45-27)31(12)16(10)15(9)28-11/h5-8H,1-4H3
61 atoms
C  -2.338551 -3.005021 -2.825261
C  -1.587863 -2.021674 -3.454753
C  -2.418953 -3.040948 -1.406537
C  -0.925817 -1.053695 -2.66806
C  -1.652408 -2.066141 -0.701553
N  -0.947928 -1.101588 -1.33176
C  -3.141559 -4.053546 -0.658419
C  -2.898433 -4.22312 0.699466
C  -2.18694 -3.201991 1.446717
C  -1.588442 -2.112628 0.745116
H  -1.487478 -2.02561 -4.545775
C  -2.078172 -3.174821 2.86396
N  -0.919463 -1.123401 1.371814
C  -0.85608 -1.098085 2.706151
C  -1.426176 -2.123247 3.493551
H  -1.337807 -2.115586 4.585101
C  0.006314 0.005894 -3.208837
O  1.042995 0.244866 -2.524076
C  -0.023834 0.047388 3.235593
O  0.947794 0.420719 2.515603
N  -0.2557 0.641815 -4.357907
N  -0.304901 0.630304 4.408739
C  -1.535032 0.612953 -5.065429
H  -1.459234 0.007247 -5.988602
H  -2.337115 0.223813 -4.420662
H  -1.79228 1.650445 -5.344343
C  0.73508 1.575529 -4.890585
H  1.734683 1.316255 -4.51082
H  0.717623 1.511194 -5.992498
H  0.48237 2.610313 -4.587084
C  -1.542714 0.452827 5.167291
H  -2.334709 0.017676 4.539652
H  -1.3707 -0.179596 6.059235
H  -1.878758 1.450124 5.502425
C  0.606173 1.647363 4.931501
H  0.214489 2.658709 4.707393
H  0.671738 1.524978 6.027074
H  1.600212 1.528603 4.475512
La 0.737368 0.586173 -0.009409
N  2.96756 -1.525813 0.193907
O  3.859875 -2.368847 0.287425
O  3.225438 -0.270973 0.198325
O  1.736713 -1.860269 0.086951
N  -1.783864 2.329359 -0.343485
O  -2.779962 3.040808 -0.484817
O  -0.944518 2.156716 -1.29658
O  -1.537545 1.72754 0.755871
N  2.040375 3.399787 -0.065241
O  2.53214 4.530827 -0.096259
O  1.226212 3.049029 0.857879
O  2.316461 2.52255 -0.952474
H  -2.519549 -3.961571 3.482882
H  -2.825917 -3.768628 -3.439475
C  -3.290371 -5.494321 1.457909
F  -4.403176 -5.328666 2.217534
F  -3.487973 -6.556803 0.64919
F  -2.281499 -5.862839 2.295709
C  -4.214569 -4.847701 -1.410973
F  -4.810015 -4.061219 -2.348073
F  -3.720082 -5.932833 -2.057942
F  -5.216025 -5.257185 -0.59923
elementType: C N H O La F
totalener: -2608.81245843 hartree
nucrepener: 6379.09812055 hartree
electener: -8987.91057899 hartree
twoeener: 7314.42432538 hartree
cpcmener: -0.08893696 hartree
kineticenergy: 2562.94553586 hartree
exchangeener: -309.240508759467 hartree
correlationener: -11.633829895601 hartree
xcener: -320.874338655068 hartree
chargesum: -0.0000000
charge: 0.142188 -0.369785 -0.421927 -0.313552 -0.240703 0.045370 -0.614752 -0.478614 -0.422668 -0.006197 -0.002131 0.127811 -0.285188 -0.160965 -0.360423 -0.085522 0.714671 -1.026029 0.738411 -1.035594 -1.428461 -1.343874 0.925680 0.083358 -0.013886 -0.121935 1.055428 -0.111123 -0.062386 0.054638 0.892387 -0.009517 0.087410 -0.147327 1.031036 0.040300 -0.030333 -0.136668 3.816162 0.497678 -0.418827 -0.615866 -0.627607 0.486111 -0.434085 -0.599848 -0.559745 0.503298 -0.440936 -0.622775 -0.577036 1.204736 1.217678 1.554780 -0.424693 -0.444792 -0.467700 1.579074 -0.467067 -0.426533 -0.441132
charge: 0.122282 0.115193 -0.011086 -0.016425 0.002300 -0.035899 0.054242 0.053418 -0.009078 -0.000193 0.040666 0.122874 -0.037996 -0.014867 0.115878 0.037140 -0.057124 -0.332027 -0.036903 -0.334815 -0.200331 -0.201712 0.244020 0.026139 0.006887 0.023022 0.251173 0.003373 0.022223 0.030130 0.243834 0.007193 0.026390 0.022534 0.250527 0.030309 0.023385 0.001778 2.019890 -0.386122 -0.042659 -0.193994 -0.199973 -0.378617 -0.044997 -0.193642 -0.194896 -0.388935 -0.053356 -0.192266 -0.189957 0.032706 0.036831 0.052352 -0.051361 -0.052159 -0.056463 0.051767 -0.056814 -0.052791 -0.053000
qa: 0.1422 -0.3698 -0.4219 -0.3136 -0.2407 0.0454 -0.6148 -0.4786 -0.4227 -0.0062 -0.0021 0.1278 -0.2852 -0.1610 -0.3604 -0.0855 0.7147 -1.0260 0.7384 -1.0356 -1.4285 -1.3439 0.9257 0.0834 -0.0139 -0.1219 1.0554 -0.1111 -0.0624 0.0546 0.8924 -0.0095 0.0874 -0.1473 1.0310 0.0403 -0.0303 -0.1367 3.8162 0.4977 -0.4188 -0.6159 -0.6276 0.4861 -0.4341 -0.5998 -0.5597 0.5033 -0.4409 -0.6228 -0.5770 1.2047 1.2177 1.5548 -0.4247 -0.4448 -0.4677 1.5791 -0.4671 -0.4265 -0.4411
va: 3.6709 4.5345 4.2181 4.7286 5.0645 4.9948 4.9491 5.2847 4.2277 4.6487 1.5834 3.4865 5.0548 4.5681 4.5428 1.5425 3.4717 1.6154 3.2989 1.7340 5.5662 5.5393 3.7515 0.8606 1.0569 0.9209 3.5686 1.1108 0.9108 0.8673 3.7873 1.0573 0.8682 0.9309 3.5854 0.8597 0.8985 1.1308 -1.8041 4.1286 1.7758 1.4838 1.3401 4.1568 1.7657 1.2230 1.3521 4.1385 1.7562 1.3221 1.4141 -0.1737 -0.1888 3.1909 0.7822 0.7362 0.8696 3.0646 0.8616 0.7756 0.7417
dispersion: -0.091827501 hartree
energy: -2608.904285935280 hartree
dipole: -143.75174 137.92362 -5.82812 -125.80857 121.30837 -4.50021 0.82636 -0.45382 0.37254
magnitude: 7.37277 au
magnitude: 18.74008 debye
temp: 298.15 k
press: 1.00 atm
zeropoint: 0.38320504 hartree
thermalvibcorrection: 0.04247300 hartree
thermalrotcorrection: 0.00141627 hartree
thermaltrasncorrection: 0.00141627 hartree
thermaltotal: -2608.47577536 hartree
thermalcorr: 0.04530554 hartree
nonthermalcorr: 0.38320504 hartree
totalcorr: 0.42851058 hartree
thermalcorrenthalpy: 0.00094421 hartree
totalenthalpy: -2608.47483115 hartree
vibrat: 0.07916592 hartree
rotat: 0.01835290 hartree
transl: 0.02178638 hartree
total: 0.11930520 hartree
totalentropycorr: -0.11930520 hartree
gibbsenthalpy: -2608.59413635 hartree
gibbsminuselec: 0.31014958 hartree
