program: Gaussian 09
title: 000063243
version: EM64L-G09RevD.01
frameworkgroup: C1[X(C15H10FN3O3)]
method: RPBEPBE
basis: SDD
operation: Freq
keyword: #p
keyword: freq=noraman
keyword: PBEPBE/SDD
title: #p freq=noraman PBEPBE/SDD
converged: NO YES NO NO
title: Mulliken charges:
elementType: F O O O N N N C C C C C C C C C C C C C C C H H H H H H H H H H
charge: -0.198195 -0.233783 -0.183190 -0.192712 -0.339101 -0.029563 0.012405 0.368082 0.215392 0.135544 0.137643 0.036747 0.303629 -0.303074 -0.475479 -0.772942 -0.314309 -0.365310 0.337314 -0.349776 -0.224064 -0.206612 0.264638 0.297029 0.240417 0.259856 0.271511 0.267781 0.283774 0.263125 0.245426 0.247796
chargesum: 0.00000
title: Mulliken charges with hydrogens summed into heavy atoms:
elementType: F O O O N N N C C C C C C C C C C C C C C C
charge: -0.198195 -0.233783 -0.183190 -0.192712 -0.339101 -0.029563 0.012405 0.368082 0.215392 0.135544 0.137643 0.036747 0.303629 -0.038436 -0.178449 -0.001158 -0.046528 -0.081536 0.337314 -0.086652 0.021362 0.041184
polarizability: 2.90704297e+02 -1.03786868e+01 1.68973141e+02 -2.06752622e+01 2.14697163e+00 1.44453464e+02
1716.lowfreq: -3.9919 -0.0003 0.0005 0.0007 1.0662 8.9407 25.0686 36.3146 50.0469
frequency: 25.0584 36.2919 50.0447 73.6102 80.4132 111.6240 130.4432 154.1499 169.0461 203.3646 214.3161 219.7280 259.3990 281.9319 320.5307 361.9243 371.8007 383.5523 399.1739 420.4937 429.7905 461.8341 495.5336 533.7943 540.9010 551.9291 572.6709 582.0613 623.3772 635.2101 643.4296 668.4800 689.9589 700.4132 724.1108 756.9550 783.4671 787.6354 790.3573 840.1724 847.0317 887.7188 909.2953 922.2315 966.1216 970.1525 990.8403 1001.6342 1015.1533 1036.5431 1046.4177 1069.4716 1083.3097 1111.1912 1137.2242 1142.0645 1176.6876 1206.5263 1217.8672 1233.5824 1245.9094 1266.6467 1275.2506 1307.4943 1369.1340 1384.9863 1391.6039 1394.2138 1430.1119 1436.0948 1449.3591 1465.7537 1466.8836 1474.7609 1567.7074 1569.5189 1586.9712 1608.5138 1618.5204 1624.8203 2994.6635 3076.3634 3134.9071 3147.1502 3159.1794 3165.7077 3172.2595 3177.2311 3185.1147 3185.2600
redmass: 8.3812 7.6967 10.9035 6.4585 6.1716 5.3840 5.0182 2.4268 1.6692 5.2346 5.9635 4.8520 7.0018 5.7000 4.5021 8.1519 7.8535 5.6268 5.9640 5.0426 4.4096 4.3711 4.5749 4.8467 7.1213 6.9469 4.4361 5.5063 4.7115 5.1040 6.6703 5.5581 6.7327 6.0862 4.9674 5.4555 1.6147 2.9102 7.4444 1.6522 5.0127 1.4814 1.5068 3.9035 1.3470 1.4078 3.9489 1.3627 2.5055 2.6188 1.5553 3.2041 2.1893 1.6532 1.8086 2.5577 1.0699 2.3434 10.0840 2.9989 3.0414 2.0743 1.9688 4.9930 7.6221 6.6498 1.5428 5.1471 3.9892 2.4232 1.1557 2.6097 1.1305 2.8667 7.8804 8.2499 6.9288 7.0788 10.6134 7.8248 1.0382 1.0972 1.0984 1.0870 1.0914 1.0888 1.0958 1.0932 1.0981 1.0991
irintensity: 0.7390 2.1951 1.0531 0.9124 0.5723 0.6589 0.5354 0.2438 1.4930 0.1301 1.2730 3.6725 2.3018 5.4104 1.8885 1.6732 6.1770 0.9027 0.3343 3.8873 1.0567 1.6870 3.2399 3.6237 0.5805 3.1423 7.7544 9.9420 3.6723 22.9182 6.3190 15.7309 9.3487 1.8271 30.8599 19.0460 32.9803 15.5994 9.1123 53.9858 7.0825 8.2791 19.2412 22.1736 0.5843 2.2087 1.8483 0.7779 1.9074 1.5324 5.1468 15.2674 21.8267 15.9500 2.5852 7.5470 3.0812 10.4903 185.9496 90.3645 11.5290 1.8235 38.1452 153.7317 139.5454 11.2306 43.1752 13.7462 9.0332 4.4811 25.4909 219.6224 50.1359 28.2110 24.5605 185.2934 18.6095 7.5183 285.4420 59.0317 13.6308 7.4307 6.4485 1.4495 8.5240 1.5934 4.7624 4.4789 5.7302 7.2796
temp: 298.150 k
press: 1.00000 atm
elementType: 9 8 8 8 7 7 7 6 6 6 6 6 6 6 6 6 6 6 6 6 6 6 1 1 1 1 1 1 1 1 1 1
symmnumber: 1
zpe: 588455.8 jmol-1
zpe.correction: 0.224131 hartree
zpe.thermalcorrener: 0.242083 hartree
zpe.thermalcorrenthalpy: 0.243027 hartree
zpe.thermalcorrgfe: 0.176997 hartree
zpe.sumelectzpe: -1065.776875 hartree
zpe.sumelectthermal: -1065.758923 hartree
zpe.sumelectthermalent: -1065.757979 hartree
zpe.sumelectthermalfe: -1065.824009 hartree
dipole: 3.9746 4.3519 -3.5153
dipole: 6.8625
quadrupole: -103.6599 -131.8528 -128.2653
quadrupole: -1.8316 -12.7909 -0.5850
quadrupole: 17.5994 -10.5935 -7.0060 -1.8316 -12.7909 -0.5850
hfenergy: -1066.0010059 hartree
pointgroup: C01 [X(C15H10F1N3O3)]
dipole: 1.5569131 1.3303032 -1.7594827 debye
polarizability: 290.9664024|-14.2679254|168.3025743|-17.2370008|-4.1074966|144.8619245 unknown
InChI: InChI=1S/C15H10FN3O3/c1-9-17-12-7-6-10(16)8-11(12)15(20)18(9)13-4-2-3-5-14(13)19(21)22/h2-8H,1H3
charge 0 multiplicity 1
32 atoms
F  -5.239209 -1.913608 -0.013398
O  -0.048637 -1.883378 -0.418725
O  2.794321 -1.2071 2.699467
O  1.276728 0.44225 2.280005
N  0.411474 0.419553 -0.356869
N  -1.295185 2.084059 -0.057306
N  2.209663 -0.371894 1.911092
C  1.811191 0.096916 -0.552379
C  -1.904463 -0.322774 -0.179433
C  -0.020762 1.760423 -0.187523
C  -0.489732 -0.702752 -0.321543
C  -2.258773 1.059704 -0.060849
C  2.666024 -0.325663 0.49955
C  2.324079 0.107627 -1.866803
C  -2.900814 -1.331655 -0.160804
C  1.031334 2.83688 -0.134179
C  -3.630857 1.414788 0.070892
C  3.997184 -0.721052 0.248124
C  -4.231465 -0.93231 -0.031056
C  -4.623003 0.422973 0.08524
C  3.661358 -0.261836 -2.126918
C  4.499333 -0.67835 -1.067097
H  1.653873 0.390122 -2.684964
H  -2.616304 -2.384134 -0.246405
H  1.65448 2.863518 -1.045581
H  1.701511 2.674569 0.729745
H  0.522784 3.803859 -0.015089
H  -3.883186 2.474412 0.164478
H  4.611211 -1.059303 1.087214
H  -5.683049 0.672405 0.187106
H  4.040031 -0.23992 -3.153662
H  5.53346 -0.977127 -1.263829
