program: Orca
programVersion: 5.0.4
elementType: C C C C C N C C C C H C N C C H C O C O N N C H H H C H H H C H H H C H H H Ho N O O O N O O O N O O O H H F F
elementType: Ho
keywords: def2-SVPD def2/JK def2/J def2-SVPD/C PBE rijcosx rhf hcore XYZFile VeryTightSCF freq cpcm(water) D3 defgrid3
charge: 0
multiplicity: 1
frequency: 0.00 0.00 0.00 0.00 0.00 0.00 18.85 25.03 34.34 34.90 41.75 43.32 51.08 56.10 64.47 76.91 80.51 88.79 91.52 94.87 103.74 106.48 112.99 118.32 119.67 131.24 141.06 146.09 147.84 155.75 163.10 168.35 171.88 172.76 178.21 184.73 187.03 193.27 197.96 203.38 219.60 225.50 232.04 243.97 270.70 277.47 278.89 291.19 298.51 307.76 334.07 354.99 365.79 401.63 419.31 424.82 445.65 462.96 469.88 479.24 505.27 520.34 540.04 595.75 609.03 633.20 663.68 664.99 673.75 682.68 701.12 702.10 703.27 703.84 717.62 736.02 737.40 738.52 743.63 748.51 796.46 797.23 797.82 799.27 824.41 835.86 837.89 855.92 912.15 936.82 964.51 966.93 969.32 1029.65 1045.53 1048.65 1055.70 1057.98 1059.71 1071.18 1071.99 1072.52 1109.50 1113.51 1120.35 1122.42 1123.64 1130.39 1185.27 1192.29 1212.94 1239.98 1251.90 1272.99 1280.10 1289.13 1297.52 1334.40 1356.26 1363.75 1372.57 1375.62 1376.80 1381.87 1383.31 1394.19 1395.01 1397.73 1399.66 1411.46 1411.69 1413.18 1418.86 1423.27 1425.51 1463.64 1465.73 1470.83 1473.00 1477.30 1493.30 1502.01 1514.31 1560.96 1593.00 1608.94 1615.16 1621.51 1639.43 2977.50 2977.81 2981.66 2981.96 3062.03 3063.91 3066.90 3068.27 3111.20 3112.86 3120.54 3120.55 3151.33 3151.75 3171.24 3178.32
frequency: 18.85 25.03 34.34 34.90 41.75 43.32 51.08 56.10 64.47 76.91 80.51 88.79 91.52 94.87 103.74 106.48 112.99 118.32 119.67 131.24 141.06 146.09 147.84 155.75 163.10 168.35 171.88 172.76 178.21 184.73 187.03 193.27 197.96 203.38 219.60 225.50 232.04 243.97 270.70 277.47 278.89 291.19 298.51 307.76 334.07 354.99 365.79 401.63 419.31 424.82 445.65 462.96 469.88 479.24 505.27 520.34 540.04 595.75 609.03 633.20 663.68 664.99 673.75 682.68 701.12 702.10 703.27 703.84 717.62 736.02 737.40 738.52 743.63 748.51 796.46 797.23 797.82 799.27 824.41 835.86 837.89 855.92 912.15 936.82 964.51 966.93 969.32 1029.65 1045.53 1048.65 1055.70 1057.98 1059.71 1071.18 1071.99 1072.52 1109.50 1113.51 1120.35 1122.42 1123.64 1130.39 1185.27 1192.29 1212.94 1239.98 1251.90 1272.99 1280.10 1289.13 1297.52 1334.40 1356.26 1363.75 1372.57 1375.62 1376.80 1381.87 1383.31 1394.19 1395.01 1397.73 1399.66 1411.46 1411.69 1413.18 1418.86 1423.27 1425.51 1463.64 1465.73 1470.83 1473.00 1477.30 1493.30 1502.01 1514.31 1560.96 1593.00 1608.94 1615.16 1621.51 1639.43 2977.50 2977.81 2981.66 2981.96 3062.03 3063.91 3066.90 3068.27 3111.20 3112.86 3120.54 3120.55 3151.33 3151.75 3171.24 3178.32
formula: C18H16F2HoN7O11
InChI: InChI=1/C18H16F2N4O2.Ho.3NO3/c1-23(2)17(25)11-7-5-9-13(19)14(20)10-6-8-12(18(26)24(3)4)22-16(10)15(9)21-11;;3*2-1(3)4/h5-8H,1-4H3;;;;/q-4;+10;3*-2/rC18H16F2HoN7O11/c1-22(2)17-11-7-5-9-13(19)14(20)10-6-8-12-18(23(3)4)33-21(32-17,34-26(29)35-21,36-27(30)37-21,38-28(31)39-21)24(11)15(9)16(10)25(12)21/h5-8H,1-4H3
55 atoms
C  -2.378231 -2.934136 -2.817323
C  -1.597837 -1.966652 -3.442567
C  -2.467845 -2.946721 -1.404631
C  -0.931653 -0.99656 -2.655092
C  -1.73858 -1.952082 -0.688597
N  -1.011727 -1.010237 -1.318564
C  -3.20045 -3.921842 -0.650695
C  -3.171374 -3.942016 0.727605
C  -2.406372 -2.988665 1.47625
C  -1.703682 -1.976611 0.75785
H  -1.479244 -1.986375 -4.530724
C  -2.258398 -3.009373 2.883885
N  -0.94922 -1.054426 1.379086
C  -0.840855 -1.049404 2.712118
C  -1.470522 -2.043682 3.502364
H  -1.320582 -2.086831 4.585109
C  0.057243 0.035402 -3.144118
O  0.985514 0.344854 -2.339607
C  0.105721 0.031165 3.18116
O  0.926758 0.468252 2.320783
N  -0.032231 0.580063 -4.365013
N  0.097794 0.500948 4.4373
C  -1.204469 0.510527 -5.236241
H  -1.03313 -0.18842 -6.077337
H  -2.100852 0.215134 -4.670663
H  -1.378022 1.520286 -5.648724
C  1.035726 1.468331 -4.820696
H  1.968074 1.238199 -4.283895
H  1.174397 1.318076 -5.90553
H  0.756038 2.524334 -4.637439
C  -0.971445 0.299569 5.414756
H  -1.918085 0.038468 4.917836
H  -0.696567 -0.478192 6.153082
H  -1.119569 1.253585 5.950283
C  1.155349 1.424614 4.847518
H  0.803357 2.471397 4.763369
H  1.407727 1.215588 5.901977
H  2.041737 1.284276 4.211218
Ho 0.406681 0.62117 -0.01167
N  2.752546 -1.126318 0.069129
O  3.743019 -1.857273 0.108331
O  2.850789 0.149057 0.070518
O  1.565103 -1.598529 0.023981
N  -2.125598 2.015324 -0.628219
O  -3.161603 2.630202 -0.888867
O  -1.111421 2.042457 -1.409039
O  -2.001117 1.313466 0.429548
N  1.161255 3.469321 0.224238
O  1.464316 4.663206 0.292153
O  0.268278 2.95432 0.977975
O  1.722991 2.676134 -0.60629
H  -2.746811 -3.791818 3.47789
H  -2.898617 -3.697296 -3.409276
F  -3.851667 -4.889244 1.391291
F  -3.907974 -4.849926 -1.312745
elementType: C N H O Ho F
totalener: -2140.06526672 hartree
nucrepener: 5092.09145282 hartree
electener: -7232.15671953 hartree
twoeener: 5855.01910492 hartree
cpcmener: -0.09049454 hartree
kineticenergy: 2094.64933755 hartree
exchangeener: -259.484648574738 hartree
correlationener: -9.963247160397 hartree
xcener: -269.447895735135 hartree
chargesum: 0.0000000
charge: -0.118814 -0.494652 -0.701279 -0.203958 0.128543 0.036935 0.347163 0.301228 -0.676856 0.400887 0.090761 -0.181178 -0.220669 -0.126700 -0.467077 0.095184 0.839865 -0.883135 0.852391 -1.042347 -1.394222 -1.322814 0.904394 0.107727 -0.024409 -0.164337 1.043094 -0.117659 -0.070834 0.054513 0.855149 0.028087 0.137774 -0.222058 1.008273 0.039988 -0.033093 -0.125148 3.059015 0.556303 -0.435057 -0.579708 -0.559087 0.536896 -0.447969 -0.517799 -0.519736 0.552139 -0.448543 -0.542110 -0.530483 1.019078 1.068378 -0.445123 -0.446913
charge: 0.125879 0.113344 -0.015076 -0.002223 0.006127 -0.034913 0.078034 0.077839 -0.014799 0.001018 0.031671 0.124011 -0.043604 0.003599 0.113652 0.025323 -0.038840 -0.299297 -0.009559 -0.303692 -0.198127 -0.199899 0.242979 0.026272 0.006245 0.022059 0.250480 0.003730 0.022124 0.030733 0.241951 0.007632 0.026548 0.020986 0.248812 0.030438 0.022612 0.003311 1.537718 -0.367250 -0.038345 -0.168916 -0.166273 -0.361849 -0.041601 -0.159781 -0.165280 -0.370335 -0.047246 -0.155330 -0.165021 0.047673 0.048353 -0.087053 -0.086845
qa: -0.1188 -0.4947 -0.7013 -0.2040 0.1285 0.0369 0.3472 0.3012 -0.6769 0.4009 0.0908 -0.1812 -0.2207 -0.1267 -0.4671 0.0952 0.8399 -0.8831 0.8524 -1.0423 -1.3942 -1.3228 0.9044 0.1077 -0.0244 -0.1643 1.0431 -0.1177 -0.0708 0.0545 0.8551 0.0281 0.1378 -0.2221 1.0083 0.0400 -0.0331 -0.1251 3.0590 0.5563 -0.4351 -0.5797 -0.5591 0.5369 -0.4480 -0.5178 -0.5197 0.5521 -0.4485 -0.5421 -0.5305 1.0191 1.0684 -0.4451 -0.4469
va: 4.2064 4.4510 5.3501 4.3458 4.7426 4.9066 3.8805 3.8422 5.5441 4.3449 1.6448 4.1262 5.0639 4.2817 4.5791 1.7257 3.1507 1.5808 2.9482 1.6824 5.4927 5.3978 3.7768 0.8367 1.0409 0.9421 3.5979 1.1096 0.9045 0.8500 3.8213 0.9819 0.8248 0.9797 3.6021 0.8712 0.9059 1.1256 -0.4406 4.0576 1.7812 1.4283 1.4436 4.1145 1.7814 1.2011 1.4729 4.0742 1.7712 1.3251 1.3947 0.3856 0.2833 0.9960 0.9941
dispersion: -0.082967023 hartree
energy: -2140.148233740756 hartree
dipole: -100.56939 95.82832 -4.74107 -95.29121 89.45672 -5.83449 0.33856 0.24358 0.58214
magnitude: 7.54042 au
magnitude: 19.16621 debye
temp: 298.15 k
press: 1.00 atm
zeropoint: 0.36134584 hartree
thermalvibcorrection: 0.03603014 hartree
thermalrotcorrection: 0.00141627 hartree
thermaltrasncorrection: 0.00141627 hartree
thermaltotal: -2139.74802521 hartree
thermalcorr: 0.03886268 hartree
nonthermalcorr: 0.36134584 hartree
totalcorr: 0.40020853 hartree
thermalcorrenthalpy: 0.00094421 hartree
totalenthalpy: -2139.74708100 hartree
vibrat: 0.06639615 hartree
rotat: 0.01780342 hartree
transl: 0.02164585 hartree
total: 0.10584542 hartree
totalentropycorr: -0.10584542 hartree
gibbsenthalpy: -2139.85292642 hartree
gibbsminuselec: 0.29530732 hartree
