program: Orca
programVersion: 4.2.1
elementType: O O N N N C C C C C C C C C C C C C C C C C C C C H H H H H H H H H H H H H H H H H H H H H H H
charge: 0
multiplicity: 1
keywords: wb97x-d3
keywords: def2-TZVPP
keywords: def2/J RIJCOSX GRIDX6 NOFINALGRIDX
keywords: grid4 nofinalgrid
keywords: scfconv7
keywords: smallprint printgap noloewdin
keywords: NOSOSCF
formula: C20H23N3O2
InChI: InChI=1/C20H23N3O2/c1-20(2,3)18(24)19(23-14-21-13-22-23)25-17-11-9-16(10-12-17)15-7-5-4-6-8-15/h4-14,18-19,24H,1-3H3
48 atoms
O  -3.803468 -0.414903 -1.666533
O  -1.091097 -0.815868 -0.853232
N  -2.099811 1.09475 0.005187
N  -2.059727 1.802348 1.139139
N  -2.066461 3.167111 -0.632083
C  -4.525114 -1.092448 0.597582
C  -3.397924 -1.000295 -0.455682
C  -2.081062 -0.356742 0.024855
C  -4.054566 -1.957075 1.769344
C  -4.978829 0.269074 1.129037
C  -5.721138 -1.789391 -0.061099
C  0.224099 -0.63131 -0.559831
C  -2.093175 1.924682 -1.047094
C  0.707507 -0.050132 0.606234
C  1.120521 -1.081766 -1.525505
C  -2.052436 3.036558 0.70994
C  2.991943 -0.37462 -0.15972
C  2.078042 0.071201 0.790769
C  2.48116 -0.955801 -1.323168
C  4.445849 -0.236685 0.054265
C  5.303278 0.055561 -1.008415
C  4.999777 -0.393235 1.326669
C  6.669077 0.185605 -0.805531
C  6.36481 -0.259094 1.530468
C  7.206471 0.030008 0.464967
H  -3.126033 -2.034265 -0.695886
H  -1.865728 -0.64525 1.056391
H  -3.693044 -2.931691 1.433223
H  -3.259041 -1.490004 2.352179
H  -4.880705 -2.137131 2.459507
H  -5.262897 0.970196 0.33883
H  -4.221713 0.753352 1.744535
H  -5.864652 0.141117 1.754092
H  -5.445028 -2.760771 -0.478122
H  -6.163208 -1.197438 -0.863469
H  -6.504792 -1.961515 0.678766
H  -4.397705 0.32278 -1.491959
H  -2.090227 1.594348 -2.072851
H  0.054077 0.329457 1.37944
H  0.744969 -1.541603 -2.431089
H  -2.027725 3.875084 1.388316
H  2.429306 0.549106 1.696581
H  3.154127 -1.336768 -2.081052
H  4.900764 0.204738 -2.002851
H  4.362253 -0.642774 2.16601
H  7.314248 0.418035 -1.643123
H  6.772266 -0.390364 2.524739
H  8.272149 0.13303 0.623456
elementType: O N C H
totalener: -1090.78410798 hartree
nucrepener: 2136.74890220 hartree
electener: -3227.53301019 hartree
oneelecener: -5726.18767491 hartree
twoeener: 2498.65466472 hartree
cpcmener: -0.02903683 hartree
kineticenergy: 1085.99906800 hartree
xcener: -106.810980390219 hartree
chargesum: -0.0000000
charge: -0.417082 -0.309066 0.097642 -0.353691 -0.395919 0.172946 0.141425 0.102587 -0.349626 -0.352265 -0.317155 0.303310 0.052758 -0.195357 -0.262904 0.088959 0.112296 -0.219341 -0.149936 0.097132 -0.209923 -0.202837 -0.169962 -0.172529 -0.150549 0.099409 0.167743 0.106290 0.095595 0.100086 0.089356 0.103410 0.104908 0.099302 0.094815 0.096691 0.231689 0.180138 0.133847 0.141246 0.163896 0.145539 0.144883 0.143848 0.144102 0.156420 0.156958 0.158917
qa: -0.4171 -0.3091 0.0976 -0.3537 -0.3959 0.1729 0.1414 0.1026 -0.3496 -0.3523 -0.3172 0.3033 0.0528 -0.1954 -0.2629 0.0890 0.1123 -0.2193 -0.1499 0.0971 -0.2099 -0.2028 -0.1700 -0.1725 -0.1505 0.0994 0.1677 0.1063 0.0956 0.1001 0.0894 0.1034 0.1049 0.0993 0.0948 0.0967 0.2317 0.1801 0.1338 0.1412 0.1639 0.1455 0.1449 0.1438 0.1441 0.1564 0.1570 0.1589
va: 2.0220 2.0912 3.2917 2.8513 3.0636 3.7791 3.9666 3.8438 3.9252 3.9395 3.9202 3.7435 4.0799 3.9024 4.0408 4.0053 3.5760 4.0226 3.9466 3.5332 3.9494 3.9398 3.9225 3.9215 3.8913 1.0237 0.9797 1.0044 1.0055 1.0041 1.0110 1.0171 1.0084 1.0050 1.0130 1.0070 1.0138 1.0091 1.0346 1.0122 0.9936 1.0045 1.0013 1.0059 1.0053 0.9936 0.9935 0.9900
dispcorr: -0.024364993 hartree
energy: -1090.808472974788
dipole: -19.74426 19.09908 -0.64517 -9.16323 8.16162 -1.00161 7.35016 -6.62355 0.72661
magnitude: 1.39550 au
magnitude: 3.54709 debye
