program: Orca
programVersion: 5.0.4
elementType: C C C C C N C C C C H C N C C H C O C O N N C H H H C H H H C H H H C H H H Tb N O O O N O O O N O O O H H C H H H C H H H
elementType: Tb
keywords: def2-SVPD def2/JK def2/J def2-SVPD/C PBE rijcosx rhf hcore XYZFile VeryTightSCF freq cpcm(water) D3 defgrid3
charge: 0
multiplicity: 1
frequency: 0.00 0.00 0.00 0.00 0.00 0.00 18.81 24.39 33.46 34.23 39.76 41.42 48.57 53.86 60.42 74.95 78.47 86.01 88.78 95.04 98.32 101.18 106.66 112.80 117.28 129.03 135.92 142.32 143.36 155.23 160.60 165.03 168.74 170.57 174.84 181.65 184.04 190.68 192.13 196.78 198.33 201.66 218.83 224.09 237.40 243.07 274.85 278.61 283.61 296.75 305.68 331.36 361.03 369.65 389.60 401.51 419.72 424.64 445.35 461.01 465.04 477.80 504.07 520.13 543.26 589.16 594.10 617.67 634.85 640.54 669.56 679.80 701.70 703.29 703.75 704.82 713.11 718.10 734.57 736.31 741.66 750.88 797.76 798.44 799.47 799.91 829.36 831.79 839.93 845.20 856.13 925.81 935.42 971.56 973.52 974.11 988.32 1018.48 1038.47 1044.13 1045.38 1048.03 1055.22 1057.49 1059.27 1067.18 1072.53 1072.57 1102.07 1111.48 1119.22 1121.20 1130.37 1143.23 1172.35 1198.45 1216.45 1240.43 1253.16 1272.35 1280.06 1282.49 1289.67 1296.44 1321.22 1337.44 1339.40 1363.73 1370.81 1375.30 1376.59 1381.98 1383.62 1394.18 1395.05 1397.83 1398.74 1399.83 1401.48 1402.98 1409.18 1411.89 1412.13 1415.86 1419.08 1420.72 1425.18 1460.94 1463.55 1464.80 1469.34 1474.09 1489.82 1493.99 1514.31 1564.32 1589.24 1599.78 1601.03 1610.16 1616.75 2974.51 2976.25 2976.46 2976.67 2980.41 2980.53 3041.43 3041.67 3059.91 3061.08 3065.17 3065.48 3110.68 3112.88 3112.99 3119.52 3120.02 3124.31 3154.81 3155.18 3167.42 3173.48
frequency: 18.81 24.39 33.46 34.23 39.76 41.42 48.57 53.86 60.42 74.95 78.47 86.01 88.78 95.04 98.32 101.18 106.66 112.80 117.28 129.03 135.92 142.32 143.36 155.23 160.60 165.03 168.74 170.57 174.84 181.65 184.04 190.68 192.13 196.78 198.33 201.66 218.83 224.09 237.40 243.07 274.85 278.61 283.61 296.75 305.68 331.36 361.03 369.65 389.60 401.51 419.72 424.64 445.35 461.01 465.04 477.80 504.07 520.13 543.26 589.16 594.10 617.67 634.85 640.54 669.56 679.80 701.70 703.29 703.75 704.82 713.11 718.10 734.57 736.31 741.66 750.88 797.76 798.44 799.47 799.91 829.36 831.79 839.93 845.20 856.13 925.81 935.42 971.56 973.52 974.11 988.32 1018.48 1038.47 1044.13 1045.38 1048.03 1055.22 1057.49 1059.27 1067.18 1072.53 1072.57 1102.07 1111.48 1119.22 1121.20 1130.37 1143.23 1172.35 1198.45 1216.45 1240.43 1253.16 1272.35 1280.06 1282.49 1289.67 1296.44 1321.22 1337.44 1339.40 1363.73 1370.81 1375.30 1376.59 1381.98 1383.62 1394.18 1395.05 1397.83 1398.74 1399.83 1401.48 1402.98 1409.18 1411.89 1412.13 1415.86 1419.08 1420.72 1425.18 1460.94 1463.55 1464.80 1469.34 1474.09 1489.82 1493.99 1514.31 1564.32 1589.24 1599.78 1601.03 1610.16 1616.75 2974.51 2976.25 2976.46 2976.67 2980.41 2980.53 3041.43 3041.67 3059.91 3061.08 3065.17 3065.48 3110.68 3112.88 3112.99 3119.52 3120.02 3124.31 3154.81 3155.18 3167.42 3173.48
formula: C20H22N7O11Tb
InChI: InChI=1/C20H22N4O2.3NO3.Tb/c1-11-12(2)14-8-10-16(20(26)24(5)6)22-18(14)17-13(11)7-9-15(21-17)19(25)23(3)4;3*2-1(3)4;/h7-10H,1-6H3;;;;/q-4;3*-2;+10/rC20H22N7O11Tb/c1-11-12(2)14-8-10-16-20(22(5)6)32-39(33-25(28)34-39,35-26(29)36-39,37-27(30)38-39)23-15(19(31-39)21(3)4)9-7-13(11)17(23)18(14)24(16)39/h7-10H,1-6H3
61 atoms
C  -2.296561 -2.989725 -2.807262
C  -1.534249 -2.011855 -3.440124
C  -2.403896 -3.018309 -1.392184
C  -0.889288 -1.028623 -2.656921
C  -1.682764 -2.007567 -0.693439
N  -0.969195 -1.049413 -1.319929
C  -3.164486 -4.024393 -0.665975
C  -3.128875 -4.049585 0.727565
C  -2.333719 -3.067876 1.448763
C  -1.644915 -2.034233 0.751053
H  -1.415871 -2.033386 -4.528451
C  -2.159234 -3.08272 2.85728
N  -0.903545 -1.096343 1.371379
C  -0.78644 -1.095751 2.704544
C  -1.386779 -2.110509 3.4860
H  -1.228369 -2.163999 4.567305
C  0.070381 0.024491 -3.152772
O  1.003651 0.355559 -2.361504
C  0.131554 0.000542 3.186291
O  0.952336 0.464696 2.339134
N  -0.046088 0.571039 -4.371796
N  0.099641 0.463606 4.446072
C  -1.228503 0.480944 -5.226841
H  -1.054041 -0.208679 -6.075073
H  -2.109047 0.15951 -4.650819
H  -1.431707 1.489063 -5.630091
C  0.99647 1.482283 -4.839793
H  1.941275 1.269286 -4.31774
H  1.122716 1.338662 -5.927094
H  0.69955 2.532345 -4.648977
C  -0.976857 0.235803 5.409136
H  -1.908577 -0.053331 4.899866
H  -0.692316 -0.532965 6.153261
H  -1.158558 1.186361 5.940924
C  1.131195 1.407253 4.875235
H  0.754959 2.446518 4.802455
H  1.382366 1.191238 5.928723
H  2.024947 1.296811 4.243364
Tb 0.420025 0.623384 -0.012105
N  2.840308 -1.072159 0.062373
O  3.851664 -1.775988 0.09792
O  2.90609 0.205367 0.060236
O  1.667412 -1.578488 0.025272
N  -2.164199 1.971995 -0.647603
O  -3.218266 2.552668 -0.919227
O  -1.146176 2.031231 -1.420937
O  -2.028454 1.277589 0.413255
N  1.108555 3.518718 0.221631
O  1.373843 4.722346 0.289946
O  0.238422 2.976432 0.983455
O  1.688745 2.747299 -0.615736
H  -2.617623 -3.870818 3.465611
H  -2.792219 -3.753495 -3.417434
C  -3.864008 -5.065983 1.558562
H  -4.486742 -5.74537 0.96037
H  -3.149527 -5.68565 2.136952
H  -4.518889 -4.562893 2.296932
C  -3.943656 -5.010462 -1.49335
H  -3.260854 -5.61733 -2.121441
H  -4.544322 -5.703049 -0.887766
H  -4.627686 -4.481812 -2.18602
elementType: C N H O Tb
totalener: -2019.20861425 hartree
nucrepener: 5059.50967220 hartree
electener: -7078.71828645 hartree
twoeener: 5771.78954427 hartree
cpcmener: -0.09665657 hartree
kineticenergy: 1974.49988097 hartree
exchangeener: -251.671623975770 hartree
correlationener: -9.906724407960 hartree
xcener: -261.578348383730 hartree
chargesum: 0.0000000
charge: -0.167433 -0.527739 -0.665143 -0.303928 -0.229969 0.075823 -1.517409 -1.523654 -0.705416 0.093491 0.100741 -0.256474 -0.114715 -0.224100 -0.511175 0.122201 0.873812 -1.034637 0.843532 -1.106476 -1.398622 -1.317549 0.910228 0.104508 -0.021429 -0.162595 1.037247 -0.111394 -0.072833 0.055615 0.860585 0.029203 0.132143 -0.220721 1.009085 0.037150 -0.032733 -0.127282 3.630261 0.546655 -0.437347 -0.593742 -0.607897 0.529802 -0.446412 -0.545600 -0.543253 0.556672 -0.451080 -0.584066 -0.548585 1.136248 1.198090 1.188910 -0.542371 0.495314 0.473351 1.181456 0.481995 -0.528428 0.478087
charge: 0.112854 0.104229 -0.032037 -0.015490 -0.003862 -0.042737 -0.087188 -0.087531 -0.032046 -0.008586 0.028677 0.111289 -0.049339 -0.009950 0.104414 0.022757 -0.042492 -0.306458 -0.013760 -0.311223 -0.200150 -0.202150 0.240485 0.025063 0.005095 0.021067 0.247631 0.002583 0.021122 0.029508 0.239375 0.006373 0.025273 0.020037 0.246052 0.029126 0.021811 0.001843 1.593376 -0.371226 -0.043975 -0.171744 -0.169418 -0.365321 -0.047443 -0.163322 -0.168028 -0.374355 -0.052080 -0.160055 -0.166607 0.031772 0.032301 0.160343 -0.022341 0.025624 0.023522 0.160293 0.026035 -0.022298 0.023284
qa: -0.1674 -0.5277 -0.6651 -0.3039 -0.2300 0.0758 -1.5174 -1.5237 -0.7054 0.0935 0.1007 -0.2565 -0.1147 -0.2241 -0.5112 0.1222 0.8738 -1.0346 0.8435 -1.1065 -1.3986 -1.3175 0.9102 0.1045 -0.0214 -0.1626 1.0372 -0.1114 -0.0728 0.0556 0.8606 0.0292 0.1321 -0.2207 1.0091 0.0371 -0.0327 -0.1273 3.6303 0.5467 -0.4373 -0.5937 -0.6079 0.5298 -0.4464 -0.5456 -0.5433 0.5567 -0.4511 -0.5841 -0.5486 1.1362 1.1981 1.1889 -0.5424 0.4953 0.4734 1.1815 0.4820 -0.5284 0.4781
va: 4.3462 4.3983 4.7834 4.5406 5.3677 5.0485 6.1127 5.9918 5.1543 4.9618 1.6342 4.2748 5.2819 4.4572 4.5300 1.6790 3.1330 1.4132 2.9676 1.5479 5.5111 5.3951 3.7736 0.8370 1.0441 0.9357 3.5959 1.1141 0.9076 0.8526 3.8217 0.9877 0.8284 0.9745 3.5960 0.8705 0.9065 1.1371 -1.8969 4.0651 1.7830 1.4910 1.6261 4.1174 1.7817 1.2314 1.5711 4.0634 1.7702 1.4035 1.4486 0.0644 -0.0924 3.3333 1.4981 0.6396 0.6300 3.3448 0.6390 1.4956 0.6389
dispersion: -0.090728585 hartree
energy: -2019.299342839137 hartree
dipole: -120.10818 114.05102 -6.05716 -126.53051 118.64457 -7.88594 0.25461 0.36868 0.62328
magnitude: 9.96322 au
magnitude: 25.32449 debye
temp: 298.15 k
press: 1.00 atm
zeropoint: 0.43104844 hartree
thermalvibcorrection: 0.03748173 hartree
thermalrotcorrection: 0.00141627 hartree
thermaltrasncorrection: 0.00141627 hartree
thermaltotal: -2018.82798013 hartree
thermalcorr: 0.04031427 hartree
nonthermalcorr: 0.43104844 hartree
totalcorr: 0.47136271 hartree
thermalcorrenthalpy: 0.00094421 hartree
totalenthalpy: -2018.82703592 hartree
vibrat: 0.06902958 hartree
rotat: 0.01778614 hartree
transl: 0.02161776 hartree
total: 0.10843348 hartree
totalentropycorr: -0.10843348 hartree
gibbsenthalpy: -2018.93546940 hartree
gibbsminuselec: 0.36387343 hartree
