program: Orca
programVersion: 5.0.4
elementType: C C C C C N C C C C H C N C C H C O C O N N C H H H C H H H C H H H C H H H Nd N O O O N O O O N O O O H H C H H H C H H H
elementType: Nd
keywords: def2-SVPD def2/JK def2/J def2-SVPD/C PBE rijcosx rhf hcore XYZFile VeryTightSCF freq cpcm(water) D3 defgrid3
charge: 0
multiplicity: 1
frequency: 0.00 0.00 0.00 0.00 0.00 0.00 13.88 23.09 28.47 32.10 36.20 41.12 43.73 45.66 59.86 70.17 74.00 79.55 82.72 89.23 91.75 98.73 102.31 102.80 107.94 116.05 119.73 127.30 135.68 147.73 157.27 161.45 164.29 164.80 169.99 178.79 190.30 192.50 193.22 198.60 202.26 205.27 216.32 220.98 232.79 240.10 273.25 277.63 283.12 295.06 304.19 331.24 360.65 366.91 388.01 403.35 418.38 421.35 442.40 455.28 460.06 475.30 499.19 515.25 540.41 589.09 595.56 616.62 633.94 639.85 670.05 678.11 702.93 703.75 704.30 704.72 712.57 719.81 730.60 733.06 737.73 752.65 798.19 799.06 799.37 799.87 828.55 831.23 840.15 846.00 856.48 925.17 934.60 971.98 972.76 973.47 988.50 1018.92 1037.88 1043.36 1045.50 1045.58 1051.50 1054.55 1056.32 1066.39 1072.26 1072.57 1100.69 1110.21 1120.05 1120.89 1130.18 1143.16 1170.58 1198.80 1217.62 1240.03 1253.24 1271.06 1272.08 1280.19 1281.15 1288.67 1321.00 1337.61 1338.34 1361.96 1370.61 1374.87 1376.70 1381.84 1383.30 1394.20 1394.64 1397.05 1397.96 1399.39 1402.04 1403.25 1406.98 1411.82 1412.08 1415.12 1419.43 1419.87 1423.81 1458.32 1462.29 1465.06 1468.70 1473.77 1488.72 1495.26 1514.63 1562.93 1588.44 1599.06 1601.48 1608.62 1615.66 2974.62 2976.28 2976.93 2976.94 2980.11 2981.12 3041.20 3041.84 3059.49 3060.64 3065.14 3065.59 3112.29 3112.48 3113.99 3119.15 3120.58 3125.70 3153.57 3154.85 3163.83 3167.92
frequency: 13.88 23.09 28.47 32.10 36.20 41.12 43.73 45.66 59.86 70.17 74.00 79.55 82.72 89.23 91.75 98.73 102.31 102.80 107.94 116.05 119.73 127.30 135.68 147.73 157.27 161.45 164.29 164.80 169.99 178.79 190.30 192.50 193.22 198.60 202.26 205.27 216.32 220.98 232.79 240.10 273.25 277.63 283.12 295.06 304.19 331.24 360.65 366.91 388.01 403.35 418.38 421.35 442.40 455.28 460.06 475.30 499.19 515.25 540.41 589.09 595.56 616.62 633.94 639.85 670.05 678.11 702.93 703.75 704.30 704.72 712.57 719.81 730.60 733.06 737.73 752.65 798.19 799.06 799.37 799.87 828.55 831.23 840.15 846.00 856.48 925.17 934.60 971.98 972.76 973.47 988.50 1018.92 1037.88 1043.36 1045.50 1045.58 1051.50 1054.55 1056.32 1066.39 1072.26 1072.57 1100.69 1110.21 1120.05 1120.89 1130.18 1143.16 1170.58 1198.80 1217.62 1240.03 1253.24 1271.06 1272.08 1280.19 1281.15 1288.67 1321.00 1337.61 1338.34 1361.96 1370.61 1374.87 1376.70 1381.84 1383.30 1394.20 1394.64 1397.05 1397.96 1399.39 1402.04 1403.25 1406.98 1411.82 1412.08 1415.12 1419.43 1419.87 1423.81 1458.32 1462.29 1465.06 1468.70 1473.77 1488.72 1495.26 1514.63 1562.93 1588.44 1599.06 1601.48 1608.62 1615.66 2974.62 2976.28 2976.93 2976.94 2980.11 2981.12 3041.20 3041.84 3059.49 3060.64 3065.14 3065.59 3112.29 3112.48 3113.99 3119.15 3120.58 3125.70 3153.57 3154.85 3163.83 3167.92
formula: C20H22N7NdO11
InChI: InChI=1/C20H22N4O2.3NO3.Nd/c1-11-12(2)14-8-10-16(20(26)24(5)6)22-18(14)17-13(11)7-9-15(21-17)19(25)23(3)4;3*2-1(3)4;/h7-10H,1-6H3;;;;/q-4;3*-2;+10/rC20H22N7NdO11/c1-11-12(2)14-8-10-16-20(22(5)6)33-28(34-25(29)35-28,36-26(30)37-28,38-27(31)39-28)23-15(19(32-28)21(3)4)9-7-13(11)17(23)18(14)24(16)28/h7-10H,1-6H3
61 atoms
C  -2.302276 -3.01686 -2.816182
C  -1.567662 -2.022313 -3.454065
C  -2.378864 -3.060928 -1.399463
C  -0.911862 -1.046232 -2.671841
C  -1.654266 -2.049569 -0.702315
N  -0.956327 -1.081224 -1.333361
C  -3.119198 -4.082362 -0.674439
C  -3.079211 -4.11072 0.718432
C  -2.298382 -3.117849 1.439488
C  -1.611779 -2.079782 0.743461
H  -1.477816 -2.02212 -4.545812
C  -2.143172 -3.125663 2.850532
N  -0.882193 -1.134563 1.369335
C  -0.79431 -1.125042 2.704681
C  -1.396237 -2.13856 3.485171
H  -1.256606 -2.174389 4.570514
C  0.024421 0.014744 -3.19378
O  1.020727 0.29951 -2.464362
C  0.093859 -0.017893 3.214811
O  0.996752 0.398707 2.428944
N  -0.182355 0.616369 -4.374062
N  -0.060199 0.505048 4.441432
C  -1.427314 0.564488 -5.138833
H  -1.314977 -0.076333 -6.034385
H  -2.259138 0.203085 -4.515921
H  -1.666165 1.591408 -5.468738
C  0.827061 1.54392 -4.881202
H  1.809787 1.298266 -4.451396
H  0.860819 1.45597 -5.981142
H  0.558685 2.584553 -4.612415
C  -1.228655 0.321664 5.301467
H  -2.094476 -0.034293 4.723259
H  -1.00815 -0.37961 6.129178
H  -1.485881 1.304753 5.734316
C  0.921095 1.475613 4.92403
H  0.548747 2.506838 4.766182
H  1.069731 1.311227 6.005836
H  1.872206 1.344257 4.386926
Nd 0.58096 0.600589 -0.016962
N  2.97399 -1.24514 0.101927
O  3.951162 -1.992323 0.170741
O  3.101055 0.029224 0.095508
O  1.781545 -1.701819 0.0327
N  -1.989681 2.157499 -0.461079
O  -3.017902 2.812709 -0.64547
O  -1.060896 2.106935 -1.341056
O  -1.797296 1.493525 0.612337
N  1.571451 3.4928 0.071818
O  1.941682 4.670428 0.099789
O  0.765473 3.023597 0.947476
O  1.971322 2.682776 -0.830168
H  -2.601783 -3.916143 3.455473
H  -2.804458 -3.778408 -3.42366
C  -3.800094 -5.138399 1.548397
H  -4.401002 -5.834923 0.947781
H  -3.078506 -5.738477 2.138254
H  -4.474493 -4.645813 2.276387
C  -3.888436 -5.07655 -1.501808
H  -3.202242 -5.657143 -2.150487
H  -4.460008 -5.792294 -0.895213
H  -4.598656 -4.556488 -2.174507
elementType: C N H O Nd
totalener: -2016.21503136 hartree
nucrepener: 5004.76273409 hartree
electener: -7020.97776544 hartree
twoeener: 5714.83697943 hartree
cpcmener: -0.09592351 hartree
kineticenergy: 1972.94972593 hartree
exchangeener: -251.342991132566 hartree
correlationener: -9.894565491372 hartree
xcener: -261.237556623938 hartree
chargesum: -0.0000000
charge: -0.081830 -0.444699 -0.721869 -0.293366 -0.227096 0.070571 -1.484738 -1.497105 -0.713600 0.015682 0.010203 -0.159747 -0.140762 -0.242083 -0.454600 0.052394 0.762852 -1.039239 0.784319 -1.109090 -1.402525 -1.343077 0.916389 0.088650 -0.029905 -0.138169 1.041848 -0.111356 -0.070823 0.057353 0.887844 -0.000364 0.098080 -0.177785 1.019723 0.039519 -0.037711 -0.123693 3.841938 0.513899 -0.424857 -0.604688 -0.630898 0.499130 -0.440863 -0.582930 -0.575068 0.513129 -0.448986 -0.609133 -0.555694 1.233061 1.264379 1.159781 -0.557472 0.507154 0.489962 1.163747 0.498994 -0.545257 0.490476
charge: 0.111372 0.101759 -0.033811 -0.025800 -0.008501 -0.045916 -0.088137 -0.088388 -0.033529 -0.011618 0.031362 0.110155 -0.050253 -0.022526 0.101205 0.027720 -0.052017 -0.322443 -0.027078 -0.326844 -0.201768 -0.203703 0.240386 0.024556 0.005236 0.021218 0.247447 0.002451 0.020791 0.028954 0.239784 0.005532 0.024836 0.020463 0.246018 0.028809 0.021651 0.001173 1.816681 -0.380593 -0.044426 -0.184424 -0.184888 -0.373560 -0.047699 -0.179474 -0.183099 -0.383535 -0.056091 -0.179172 -0.176779 0.031454 0.031876 0.160091 -0.022697 0.025178 0.023969 0.160033 0.025527 -0.022686 0.023767
qa: -0.0818 -0.4447 -0.7219 -0.2934 -0.2271 0.0706 -1.4847 -1.4971 -0.7136 0.0157 0.0102 -0.1597 -0.1408 -0.2421 -0.4546 0.0524 0.7629 -1.0392 0.7843 -1.1091 -1.4025 -1.3431 0.9164 0.0886 -0.0299 -0.1382 1.0418 -0.1114 -0.0708 0.0574 0.8878 -0.0004 0.0981 -0.1778 1.0197 0.0395 -0.0377 -0.1237 3.8419 0.5139 -0.4249 -0.6047 -0.6309 0.4991 -0.4409 -0.5829 -0.5751 0.5131 -0.4490 -0.6091 -0.5557 1.2331 1.2644 1.1598 -0.5575 0.5072 0.4900 1.1637 0.4990 -0.5453 0.4905
va: 4.3190 4.4079 4.7698 4.5970 5.3242 5.1995 6.1603 6.0517 4.9363 5.0596 1.5879 4.2948 5.3607 4.5892 4.5507 1.5991 3.3481 1.5187 3.1128 1.5912 5.5321 5.4691 3.7686 0.8538 1.0568 0.9275 3.5845 1.1105 0.9117 0.8613 3.7955 1.0295 0.8550 0.9474 3.5891 0.8651 0.9036 1.1337 -2.0085 4.0978 1.7790 1.5025 1.4517 4.1350 1.7753 1.2218 1.4513 4.1237 1.7602 1.3327 1.4457 -0.1766 -0.2768 3.3942 1.5059 0.6238 0.6055 3.3826 0.6214 1.5087 0.6175
dispersion: -0.090181851 hartree
energy: -2016.305213208431 hartree
dipole: -124.04633 117.01275 -7.03358 -115.51474 107.79204 -7.72270 1.03712 -0.55031 0.48681
magnitude: 10.45698 au
magnitude: 26.57952 debye
temp: 298.15 k
press: 1.00 atm
zeropoint: 0.43038000 hartree
thermalvibcorrection: 0.03784749 hartree
thermalrotcorrection: 0.00141627 hartree
thermaltrasncorrection: 0.00141627 hartree
thermaltotal: -2015.83415317 hartree
thermalcorr: 0.04068003 hartree
nonthermalcorr: 0.43038000 hartree
totalcorr: 0.47106004 hartree
thermalcorrenthalpy: 0.00094421 hartree
totalenthalpy: -2015.83320896 hartree
vibrat: 0.07016167 hartree
rotat: 0.01781889 hartree
transl: 0.02158753 hartree
total: 0.10956808 hartree
totalentropycorr: -0.10956808 hartree
gibbsenthalpy: -2015.94277705 hartree
gibbsminuselec: 0.36243616 hartree
