program: Orca
programVersion: 5.0.4
elementType: C C C C C N C C C C H C N C C H C O C O N N C H H H C H H H C H H H C H H H Sm N O O O N O O O N O O O H H O C H H H O C H H H
elementType: Sm
keywords: def2-SVPD def2/JK def2/J def2-SVPD/C PBE rijcosx rhf hcore XYZFile VeryTightSCF freq cpcm(water) D3 defgrid3
charge: 0
multiplicity: 1
frequency: 0.00 0.00 0.00 0.00 0.00 0.00 16.77 23.62 30.54 32.68 37.20 38.63 45.10 49.46 54.43 55.11 73.21 74.48 78.99 84.93 87.60 90.54 97.90 102.49 105.67 110.10 115.94 122.50 124.61 129.50 130.12 135.64 141.58 154.55 157.36 165.19 167.70 169.56 170.94 177.45 182.69 185.24 193.20 199.15 205.68 206.73 220.75 233.03 243.21 245.24 277.82 290.52 294.05 305.68 313.14 324.11 336.91 367.29 369.11 420.47 425.36 427.98 456.79 465.60 473.90 492.63 503.28 513.12 561.43 605.31 616.70 631.97 663.02 671.87 681.24 702.34 702.50 703.90 704.32 720.07 732.54 734.27 736.39 738.34 739.54 749.31 795.42 798.35 798.63 799.59 822.38 837.46 840.50 852.94 883.62 935.44 937.99 969.74 972.45 974.94 987.00 1046.47 1046.80 1053.05 1055.52 1056.94 1064.12 1071.60 1072.84 1075.12 1112.50 1112.79 1119.23 1120.62 1122.29 1124.53 1127.64 1129.52 1155.08 1166.06 1192.12 1207.13 1214.45 1239.77 1251.98 1271.92 1274.50 1283.91 1290.44 1312.43 1340.86 1356.19 1358.80 1374.23 1376.77 1382.12 1383.44 1393.67 1394.85 1397.10 1397.73 1399.39 1401.48 1403.63 1405.98 1409.32 1411.34 1412.38 1414.90 1418.51 1420.42 1423.84 1426.72 1458.34 1460.69 1466.63 1469.83 1474.45 1489.25 1494.01 1504.58 1561.36 1590.06 1600.80 1602.78 1610.78 1618.12 2959.62 2962.02 2976.71 2976.75 2980.64 2981.01 3045.33 3047.53 3059.97 3060.16 3064.78 3065.17 3103.10 3104.06 3111.85 3112.86 3120.07 3121.76 3146.87 3147.53 3164.67 3171.32
frequency: 16.77 23.62 30.54 32.68 37.20 38.63 45.10 49.46 54.43 55.11 73.21 74.48 78.99 84.93 87.60 90.54 97.90 102.49 105.67 110.10 115.94 122.50 124.61 129.50 130.12 135.64 141.58 154.55 157.36 165.19 167.70 169.56 170.94 177.45 182.69 185.24 193.20 199.15 205.68 206.73 220.75 233.03 243.21 245.24 277.82 290.52 294.05 305.68 313.14 324.11 336.91 367.29 369.11 420.47 425.36 427.98 456.79 465.60 473.90 492.63 503.28 513.12 561.43 605.31 616.70 631.97 663.02 671.87 681.24 702.34 702.50 703.90 704.32 720.07 732.54 734.27 736.39 738.34 739.54 749.31 795.42 798.35 798.63 799.59 822.38 837.46 840.50 852.94 883.62 935.44 937.99 969.74 972.45 974.94 987.00 1046.47 1046.80 1053.05 1055.52 1056.94 1064.12 1071.60 1072.84 1075.12 1112.50 1112.79 1119.23 1120.62 1122.29 1124.53 1127.64 1129.52 1155.08 1166.06 1192.12 1207.13 1214.45 1239.77 1251.98 1271.92 1274.50 1283.91 1290.44 1312.43 1340.86 1356.19 1358.80 1374.23 1376.77 1382.12 1383.44 1393.67 1394.85 1397.10 1397.73 1399.39 1401.48 1403.63 1405.98 1409.32 1411.34 1412.38 1414.90 1418.51 1420.42 1423.84 1426.72 1458.34 1460.69 1466.63 1469.83 1474.45 1489.25 1494.01 1504.58 1561.36 1590.06 1600.80 1602.78 1610.78 1618.12 2959.62 2962.02 2976.71 2976.75 2980.64 2981.01 3045.33 3047.53 3059.97 3060.16 3064.78 3065.17 3103.10 3104.06 3111.85 3112.86 3120.07 3121.76 3146.87 3147.53 3164.67 3171.32
formula: C20H22N7O13Sm
InChI: InChI=1/C20H22N4O4.3NO3.Sm/c1-23(2)19(25)13-9-7-11-15(21-13)16-12(18(28-6)17(11)27-5)8-10-14(22-16)20(26)24(3)4;3*2-1(3)4;/h7-10H,1-6H3;;;;/q-4;3*-2;+10/rC20H22N7O13Sm/c1-21(2)19-13-9-7-11-15-16-12(18(32-6)17(11)31-5)8-10-14-20(22(3)4)34-41(33-19,23(13)15,24(14)16,35-25(28)36-41,37-26(29)38-41)39-27(30)40-41/h7-10H,1-6H3
63 atoms
C  -1.881343 -3.160062 -2.818973
C  -1.214121 -2.116553 -3.451566
C  -2.011902 -3.161184 -1.408668
C  -0.68682 -1.061704 -2.669162
C  -1.406031 -2.081887 -0.699969
N  -0.778048 -1.069529 -1.332668
C  -2.67504 -4.217348 -0.676452
C  -2.639197 -4.242451 0.714294
C  -1.943839 -3.209085 1.447721
C  -1.372222 -2.106013 0.747271
H  -1.068395 -2.137436 -4.536803
C  -1.751809 -3.246601 2.850512
N  -0.726552 -1.108198 1.380306
C  -0.609795 -1.11673 2.713573
C  -1.086009 -2.204465 3.486559
H  -0.904374 -2.25391 4.564792
C  0.176483 0.066899 -3.178187
O  1.095173 0.469966 -2.404412
C  0.180862 0.06521 3.219108
O  0.985789 0.602827 2.400976
N  -0.010306 0.599497 -4.39423
N  0.046042 0.527683 4.47163
C  -1.198735 0.407118 -5.223622
H  -0.980219 -0.256955 -6.081893
H  -2.032561 0.000459 -4.632085
H  -1.503502 1.3953 -5.61218
C  0.943667 1.590457 -4.888139
H  1.910426 1.464881 -4.378045
H  1.066214 1.444661 -5.975724
H  0.560293 2.613374 -4.704816
C  -1.036017 0.182029 5.392667
H  -1.905017 -0.220877 4.850804
H  -0.693597 -0.541278 6.157607
H  -1.350803 1.108458 5.904498
C  0.945846 1.581692 4.93781
H  0.444387 2.567167 4.873636
H  1.200865 1.379787 5.993359
H  1.858064 1.594056 4.323323
Sm 0.528408 0.739616 -0.008981
N  3.056173 -0.861067 0.112758
O  4.09862 -1.515002 0.174168
O  3.062911 0.41912 0.104972
O  1.910227 -1.424592 0.05299
N  -2.160872 1.95019 -0.617112
O  -3.248478 2.47328 -0.870555
O  -1.168485 2.043139 -1.420309
O  -1.964706 1.285574 0.454763
N  1.110606 3.700843 0.147321
O  1.323319 4.916026 0.186018
O  0.286417 3.137465 0.945492
O  1.70214 2.940763 -0.692478
H  -2.110315 -4.108559 3.42633
H  -2.277746 -3.999511 -3.403131
O  -3.187706 -5.286774 1.395293
C  -4.466093 -5.034158 2.016436
H  -4.707282 -5.937338 2.600375
H  -4.41816 -4.154691 2.688083
H  -5.238518 -4.865507 1.241163
O  -3.263418 -5.235043 -1.364264
C  -4.564817 -4.949823 -1.9205
H  -4.534028 -4.056671 -2.574785
H  -4.8466 -5.836446 -2.511477
H  -5.297845 -4.786182 -1.106821
elementType: C N H O Sm
totalener: -2167.59422187 hartree
nucrepener: 5467.80645934 hartree
electener: -7635.40068121 hartree
twoeener: 6232.90833320 hartree
cpcmener: -0.09858331 hartree
kineticenergy: 2122.63466897 hartree
exchangeener: -267.908395631119 hartree
correlationener: -10.455126893986 hartree
xcener: -278.363522525105 hartree
chargesum: -0.0000000
charge: 0.000764 -0.438166 -0.786955 -0.231955 -0.060346 -0.141227 0.030387 -0.004659 -0.832825 0.201709 -0.009362 -0.087642 -0.260935 -0.172758 -0.444101 0.034238 0.815144 -1.096729 0.826173 -1.142543 -1.417126 -1.349168 0.918159 0.100043 -0.008215 -0.153818 1.039595 -0.118359 -0.066835 0.055807 0.874098 0.043789 0.121032 -0.210686 1.021739 0.032677 -0.027698 -0.141825 4.054254 0.540252 -0.423686 -0.615561 -0.639129 0.524740 -0.439735 -0.578213 -0.582982 0.545808 -0.445645 -0.619290 -0.588260 1.152769 1.178864 -0.943598 1.117472 -0.133670 0.113725 -0.140791 -0.946008 1.117955 0.112611 -0.140405 -0.132897
charge: 0.119782 0.107816 -0.003761 -0.016478 -0.000273 -0.041862 0.024479 0.024181 -0.003672 -0.004477 0.031929 0.118433 -0.046774 -0.011338 0.107406 0.026835 -0.046729 -0.314492 -0.019055 -0.320203 -0.201241 -0.203004 0.240952 0.024930 0.006019 0.021507 0.248289 0.002400 0.021466 0.029337 0.240173 0.007107 0.025107 0.020173 0.247104 0.029099 0.022546 0.000742 1.728891 -0.375924 -0.043465 -0.179935 -0.178181 -0.370186 -0.046841 -0.173569 -0.178418 -0.379604 -0.052793 -0.169903 -0.173974 0.044342 0.044587 -0.347275 0.283758 0.027015 0.018366 0.013141 -0.346808 0.283799 0.017864 0.027133 0.013525
qa: 0.0008 -0.4382 -0.7870 -0.2320 -0.0603 -0.1412 0.0304 -0.0047 -0.8328 0.2017 -0.0094 -0.0876 -0.2609 -0.1728 -0.4441 0.0342 0.8151 -1.0967 0.8262 -1.1425 -1.4171 -1.3492 0.9182 0.1000 -0.0082 -0.1538 1.0396 -0.1184 -0.0668 0.0558 0.8741 0.0438 0.1210 -0.2107 1.0217 0.0327 -0.0277 -0.1418 4.0543 0.5403 -0.4237 -0.6156 -0.6391 0.5247 -0.4397 -0.5782 -0.5830 0.5458 -0.4456 -0.6193 -0.5883 1.1528 1.1789 -0.9436 1.1175 -0.1337 0.1137 -0.1408 -0.9460 1.1180 0.1126 -0.1404 -0.1329
va: 4.0618 4.3800 4.7162 4.6156 4.9174 4.8595 4.8355 4.7042 4.8481 4.6224 1.6478 4.0402 5.0551 4.5195 4.5723 1.6899 3.2841 1.3853 3.0259 1.4622 5.5280 5.4131 3.7647 0.8401 1.0421 0.9316 3.5893 1.1177 0.9086 0.8522 3.8012 0.9888 0.8368 0.9676 3.5846 0.8686 0.8968 1.1452 -2.7721 4.0584 1.7841 1.5410 1.5204 4.1011 1.7857 1.2324 1.5336 4.0731 1.7685 1.4132 1.4616 0.0838 0.0323 2.4036 3.4677 0.9714 1.0261 1.1706 2.4063 3.4643 1.0304 0.9724 1.1652
dispersion: -0.092656907 hartree
energy: -2167.686878776118 hartree
dipole: -135.39170 128.90782 -6.48388 -151.57305 144.50057 -7.07248 0.29720 0.33209 0.62929
magnitude: 9.61544 au
magnitude: 24.44050 debye
temp: 298.15 k
press: 1.00 atm
zeropoint: 0.43851708 hartree
thermalvibcorrection: 0.04040945 hartree
thermalrotcorrection: 0.00141627 hartree
thermaltrasncorrection: 0.00141627 hartree
thermaltotal: -2167.20511970 hartree
thermalcorr: 0.04324199 hartree
nonthermalcorr: 0.43851708 hartree
totalcorr: 0.48175908 hartree
thermalcorrenthalpy: 0.00094421 hartree
totalenthalpy: -2167.20417549 hartree
vibrat: 0.07520926 hartree
rotat: 0.01799061 hartree
transl: 0.02166478 hartree
total: 0.11486464 hartree
totalentropycorr: -0.11486464 hartree
gibbsenthalpy: -2167.31904013 hartree
gibbsminuselec: 0.36783865 hartree
