program: Gaussian 09
title: 000063236
version: EM64L-G09RevD.01
frameworkgroup: C1[X(C18H15ClN2O)]
method: RPBEPBE
basis: SDD
operation: Freq
keyword: #p
keyword: freq=noraman
keyword: PBEPBE/SDD
title: #p freq=noraman PBEPBE/SDD
converged: YES YES NO NO
title: Mulliken charges:
elementType: Cl O N N C C C C C C C C C C C C C C C C C C H H H H H H H H H H H H H H H
charge: -0.037791 -0.235339 -0.222142 -0.001692 -0.113602 -0.508507 -0.488496 -0.461820 0.433317 -0.002453 0.165674 -0.016164 -0.293026 -0.356552 0.322293 -0.216644 -0.276841 -0.393765 -0.364411 -0.234444 -0.230555 -0.231905 0.258803 0.245540 0.223985 0.271709 0.227285 0.252971 0.255299 0.283120 0.262194 0.243843 0.266761 0.273683 0.232037 0.233750 0.233883
chargesum: 0.00000
title: Mulliken charges with hydrogens summed into heavy atoms:
elementType: Cl O N N C C C C C C C C C C C C C C C C C C
charge: -0.037791 -0.235339 -0.222142 -0.001692 0.145201 -0.038983 0.010498 0.046450 0.433317 -0.002453 0.165674 -0.016164 -0.293026 -0.073433 0.322293 0.045550 -0.032997 -0.127003 -0.090728 -0.002408 0.003196 0.001978
polarizability: 3.28949980e+02 -7.53546674e-01 2.45096561e+02 -1.55668593e+01 5.92847944e+00 1.21742308e+02
1716.lowfreq: -3.9615 -3.3938 0.0002 0.0007 0.0014 7.6262 24.3542 29.8093 54.6565
frequency: 24.2456 29.7994 54.6219 62.2999 81.0724 95.6728 108.6668 128.4334 186.7650 208.0025 227.4800 242.5141 247.0487 256.4942 291.6477 322.0382 363.3119 385.6375 407.1524 422.4529 459.6816 469.4490 483.1112 502.2742 518.2044 553.6412 613.8778 616.5591 644.2812 668.5475 686.1840 702.7613 717.0866 731.0666 751.8064 770.2655 775.8409 785.0952 794.3370 804.6528 828.0718 858.8373 864.5946 913.6236 921.7467 938.2669 943.0900 949.0915 975.0931 988.4889 990.0670 1001.4183 1002.5816 1020.1932 1028.8629 1044.0211 1063.0747 1074.8121 1086.3806 1099.4526 1104.3031 1140.4289 1168.9422 1174.9338 1177.3450 1184.4496 1193.2260 1219.1479 1235.5070 1280.8787 1309.8498 1316.2101 1328.2695 1344.3869 1375.9923 1380.7705 1392.9452 1410.6038 1433.8960 1441.7166 1446.1131 1464.0206 1470.1078 1482.4819 1518.7919 1558.7067 1584.1211 1591.5184 1605.4319 1612.4009 3056.2297 3093.3701 3104.6846 3119.3690 3128.4711 3133.6084 3138.2204 3149.9489 3154.2352 3161.4100 3168.0813 3172.5662 3183.4947 3193.7826 3216.7035
redmass: 5.4638 6.3393 2.9643 4.0892 4.6085 5.1430 6.2352 4.9995 6.2601 8.7711 7.6340 5.6560 4.0421 4.6228 4.0912 4.9620 5.7607 5.7158 2.9004 4.0822 4.4393 7.3165 2.6288 6.7925 5.4820 4.1926 6.2790 6.0478 5.6836 6.4989 6.2279 1.8055 5.9773 5.2004 3.0148 1.4187 2.0526 2.7026 1.6513 2.5955 1.5552 1.2625 2.0770 3.6029 1.4198 1.5593 2.3105 4.4147 1.3578 2.4770 1.9788 1.9615 1.8558 3.0482 2.1923 1.3667 5.2623 1.2851 1.7504 1.8803 1.1690 2.1730 1.4196 1.0570 1.9199 1.6977 1.1502 1.7251 1.8236 2.1752 1.5987 1.6901 2.0343 1.6150 5.3418 7.7940 2.0630 2.3233 2.2791 1.0912 2.4959 1.2060 1.2852 2.3998 6.8606 7.5626 6.0863 8.4822 6.7498 6.6758 1.0625 1.0528 1.0609 1.0939 1.0851 1.0962 1.0885 1.0932 1.0871 1.0967 1.0922 1.0998 1.0999 1.1167 1.1151
irintensity: 2.3891 0.0304 0.7189 0.2765 0.4974 0.6870 0.6369 2.9190 0.6500 1.1969 0.3144 0.3708 1.5373 0.2467 0.5647 1.4968 5.8673 1.0967 1.1675 0.4522 1.2530 5.7313 9.5540 6.2038 3.2133 1.4653 1.3818 8.5097 3.3967 2.9184 9.8269 55.5367 3.8818 38.6748 68.0070 6.5008 22.8810 0.6508 24.9736 19.3986 14.5024 8.6015 14.9368 10.9223 0.1742 1.7363 20.3572 5.7217 1.3675 6.5333 0.6386 10.2385 12.3331 51.9518 4.4276 31.4681 77.7863 18.1036 5.8520 23.3163 0.6030 28.6560 2.8789 0.0433 0.4446 2.6176 13.2826 4.3413 8.2616 26.9662 88.4262 26.7304 156.3671 2.7884 16.3230 2.0579 29.3805 17.4543 20.4626 9.6047 24.0506 34.4905 53.3997 1.7904 211.7361 48.1879 2.8316 456.6836 19.3318 30.0951 15.3176 22.1802 13.9588 10.4958 0.8524 2.6500 5.9902 25.3596 3.0143 17.5072 0.6515 17.4410 8.1997 7.0336 12.9979
temp: 298.150 k
press: 1.00000 atm
elementType: 17 8 7 7 6 6 6 6 6 6 6 6 6 6 6 6 6 6 6 6 6 6 1 1 1 1 1 1 1 1 1 1 1 1 1 1 1
symmnumber: 1
zpe: 747112.9 jmol-1
zpe.correction: 0.284560 hartree
zpe.thermalcorrener: 0.302917 hartree
zpe.thermalcorrenthalpy: 0.303861 hartree
zpe.thermalcorrgfe: 0.236517 hartree
zpe.sumelectzpe: -1338.138202 hartree
zpe.sumelectthermal: -1338.119846 hartree
zpe.sumelectthermalent: -1338.118902 hartree
zpe.sumelectthermalfe: -1338.186245 hartree
dipole: -1.7537 5.1351 1.5753
dipole: 5.6503
quadrupole: -114.8818 -138.7537 -135.4930
quadrupole: -1.6145 -1.2850 -1.6446
quadrupole: 14.8277 -9.0442 -5.7835 -1.6145 -1.2850 -1.6446
hfenergy: -1338.4227627 hartree
pointgroup: C01 [X(C18H15Cl1N2O1)]
dipole: 0.8321328 -2.0502858 0.2135021 debye
polarizability: 327.6497699|1.424472|241.9285123|21.762287|21.1370547|126.2105661 unknown
InChI: InChI=1S/C18H15ClN2O/c19-15-8-4-7-14-16(13-5-2-1-3-6-13)20-18(22)21(17(14)15)11-12-9-10-12/h1-8,12H,9-11H2
charge 0 multiplicity 1
37 atoms
Cl -3.335964 -2.302019 -1.393778
O  -1.49119 2.800064 -0.110563
N  -1.63533 0.491004 -0.551639
N  0.502382 1.598335 -0.108819
C  -3.965745 0.47967 0.419345
C  -5.24084 1.320916 0.601859
C  -4.047279 1.520536 1.54761
C  -3.096331 0.738566 -0.803553
C  -1.053598 -0.779461 -0.414528
C  -0.890936 1.696058 -0.225129
C  0.341287 -0.84306 -0.008927
C  1.099573 0.411594 -0.008407
C  -1.693481 -2.052698 -0.607069
C  0.937948 -2.073134 0.381069
C  2.59093 0.447185 0.072941
C  -1.075983 -3.259107 -0.241904
C  0.23052 -3.277523 0.298249
C  3.414669 -0.485094 -0.616029
C  3.203965 1.505722 0.796364
C  4.820597 -0.370626 -0.562083
C  4.608097 1.608263 0.861551
C  5.422178 0.668319 0.185404
H  -4.042476 -0.571174 0.717769
H  -6.136328 0.82104 0.981389
H  -5.442313 2.109664 -0.130301
H  -3.453948 2.43054 1.429744
H  -4.136213 1.153813 2.574548
H  -3.159593 1.804052 -1.076153
H  -3.421248 0.134192 -1.661326
H  1.960828 -2.05971 0.765092
H  -1.627264 -4.192934 -0.38661
H  0.679225 -4.222514 0.616196
H  2.959578 -1.270419 -1.228793
H  2.560124 2.241725 1.287497
H  5.444726 -1.08427 -1.110958
H  5.068104 2.422785 1.431395
H  6.513728 0.751701 0.230945
