program: Gaussian 16
title: Title Card Required
version: ES64L-G16RevC.01
frameworkgroup: C1[X(C8H14N3O7P)]
method: UM062X
basis: def2SVP
operation: Freq
keyword: #N
keyword: Geom=AllCheck
keyword: Guess=TCheck
keyword: SCRF=Check
keyword: GenChk
keyword: UM062X/def2SVPFreq
converged: YES YES NO YES
elementType: C
elementType: H
elementType: N
elementType: O
elementType: P
1716.lowfreq: -177.3768 -7.4430 -0.0015 -0.0013 -0.0011 4.6842 6.3176 27.5523 52.7583
frequency: -177.3707 27.5316 52.7221 74.8708 88.8745 92.7163 97.8126 126.6428 130.3238 135.7942 154.4688 166.5915 184.1197 200.5899 239.3131 245.1926 267.8785 284.6190 297.9449 323.3799 349.9407 358.5060 366.2142 388.5727 403.1137 446.0401 460.2602 487.9741 496.1583 517.4819 539.3532 576.4324 624.1567 645.6560 663.6125 686.7345 705.8219 710.5013 731.7748 742.6306 772.0301 797.1671 812.7343 856.2222 860.2597 882.7322 916.6481 925.8098 956.0532 973.4771 981.5242 1006.2570 1037.3482 1078.5999 1097.3544 1126.3768 1127.4469 1155.5295 1159.4640 1209.6902 1238.6995 1254.2186 1271.9839 1275.6276 1296.9942 1310.4738 1324.6024 1351.2939 1364.8855 1389.1166 1393.4264 1426.3880 1479.0435 1495.4649 1584.1887 1605.2935 1719.7380 1781.2807 1794.1617 2999.8373 3197.2423 3215.3799 3237.9013 3263.4574 3272.3570 3293.9436 3551.3584 3671.9437 3703.0309 3762.0280 3818.2952 3839.2079 3868.0043
redmass: 3.6867 5.6771 7.7029 7.1253 8.3210 7.8711 4.1084 6.7803 2.4999 4.8496 3.1392 4.8528 5.5820 4.7628 4.3561 3.8753 2.1909 1.2183 2.2054 4.8309 4.1896 1.9699 2.8548 2.7624 3.3428 5.8104 10.2997 6.1456 6.2282 1.7087 1.2376 3.3427 4.3016 1.2920 1.9816 1.4875 2.7980 4.0745 2.8371 1.6606 1.7622 2.9281 1.2147 3.3899 1.7570 4.6041 3.2323 2.1712 2.7561 1.3573 1.3963 1.4777 3.7640 2.5991 1.5263 2.2973 1.8023 2.2014 3.1367 1.2813 1.3949 1.7105 1.2689 1.7475 1.9765 2.1515 6.8213 2.1714 2.0723 1.9956 1.3196 1.4217 1.8052 2.9894 2.1772 1.8484 6.0685 6.4855 7.7398 1.0818 1.0977 1.0876 1.1006 1.0906 1.1012 1.1001 1.0522 1.0952 1.0642 1.0666 1.0676 1.0668 1.0671
irintensity: 147.5045 3.6042 2.7150 1.2749 1.9316 3.8018 16.0542 0.5892 31.4137 7.0416 20.6880 2.4202 6.7364 1.4745 1.2166 15.6423 28.9215 116.8816 22.8659 28.2264 35.0877 13.7205 13.4168 27.3567 12.0173 20.3616 30.9195 64.4698 26.7652 43.1074 129.5846 47.9398 95.2375 77.0181 172.8670 132.1884 72.6741 58.8784 51.4965 14.1690 34.9077 14.0367 172.2713 36.9031 33.6692 18.5950 277.8445 82.0936 118.9379 8.0446 99.4198 0.1960 118.1166 115.1002 31.6794 16.4946 97.8993 113.2383 206.6733 280.5851 15.9999 95.3879 17.3615 54.3079 150.6829 147.6609 214.2300 359.5515 21.2473 262.6112 25.5929 34.1421 247.8032 38.8043 43.5791 68.8789 169.3658 441.2246 146.2266 2.4320 46.9862 6.6122 0.6917 44.7953 4.8639 10.6818 100.8233 84.8959 332.3568 70.2445 586.8080 251.8272 288.3226
temp: 298.150 k
press: 1.00000 atm
elementType: 6 1 6 6 1 6 1 6 1 6 1 7 7 7 1 1 6 1 8 1 8 1 8 8 1 8 1 15 8 6 1 8 1
symmnumber: 1
zpe: 657203.9 jmol-1
zpe.correction: 0.250316 hartree
zpe.thermalcorrener: 0.270237 hartree
zpe.thermalcorrenthalpy: 0.271181 hartree
zpe.thermalcorrgfe: 0.201788 hartree
zpe.sumelectzpe: -1343.679971 hartree
zpe.sumelectthermal: -1343.660050 hartree
zpe.sumelectthermalent: -1343.659106 hartree
zpe.sumelectthermalfe: -1343.728499 hartree
dipole: 4.4209 4.2690 -2.4388
dipole: 6.6119
quadrupole: -87.9702 -93.3186 -86.4278
quadrupole: -4.0566 2.5667 -15.7937
quadrupole: 1.2687 -4.0797 2.8110 -4.0566 2.5667 -15.7937
hfenergy: -1343.9302869 hartree
pointgroup: C01 [X(C8H14N3O7P1)]
dipole: 1.7200581 1.7056594 -0.9481397 debye
polarizability: 161.2442372|36.8984613|178.624011|3.9467653|4.4977903|141.7592913 unknown
InChI: InChI=1/C4H6N3O.C4H8O6P/c5-4-1-6-2-7(4)3-8;5-3-4(6)1-2-10-11(7,8)9/h1-3,8H,5H2;1-8H
charge 1 multiplicity 2
33 atoms
C  -0.94231438 1.29459948 1.99364114
H  -0.82852891 1.08511714 3.0538556
C  -0.0037927 1.83662077 1.16643517
C  -1.16361871 -1.93967951 1.08906101
H  -1.7057928 -2.03550623 2.03298482
C  -1.94218682 1.29999944 0.08109495
H  -2.66978074 1.32169486 -0.72840652
C  -1.5396998 -0.89352 -1.19985143
H  -0.49560735 -0.81274709 -1.50141903
C  -2.02924229 -1.84632767 -0.14109103
H  -2.09676959 -2.85957362 -0.58801084
N  -2.12564595 1.00742442 1.31706414
N  -0.64839398 1.90237122 -0.10423759
N  1.25027249 2.35699602 1.33731551
H  1.93531382 2.00162512 0.6710958
H  1.58166336 2.30024188 2.29433678
C  0.16129849 -1.97886979 1.16066152
H  0.70135477 -2.06890097 2.10530775
O  -3.35889328 -1.49404988 0.1748559
H  -3.33171072 -0.75659869 0.80717866
O  -2.42338149 -0.57879169 -2.15461716
H  -3.30722555 -0.82503775 -1.82158591
O  0.96897659 -1.98651173 0.0320548
O  3.17179589 -1.73714941 -1.02295808
H  3.49139507 -1.34016579 -1.84581736
O  2.72268474 -0.53268318 1.16852924
H  3.36313327 -1.17869954 1.50366449
P  2.08533938 -0.87742379 -0.25437002
O  1.60328098 0.34147816 -0.94104167
C  -0.22547676 2.35396425 -1.25182055
H  -0.87230851 2.19259755 -2.12430476
O  0.88867147 2.98060405 -1.36030025
H  1.10915401 3.20225998 -2.27898405
