program: Gaussian 16
title: Title Card Required
version: ES64L-G16RevC.01
frameworkgroup: C1[X(C8H14N3O7P)]
method: UM062X
basis: def2SVP
operation: Freq
keyword: #N
keyword: Geom=AllCheck
keyword: Guess=TCheck
keyword: SCRF=Check
keyword: GenChk
keyword: UM062X/def2SVPFreq
converged: YES YES NO YES
elementType: C
elementType: H
elementType: N
elementType: O
elementType: P
1716.lowfreq: -25.2860 -3.6281 0.0008 0.0019 0.0021 6.7738 12.6434 25.9186 60.0465
frequency: -24.1678 25.6739 59.9908 79.9884 82.7001 98.0826 106.5744 134.2412 155.7433 161.1624 165.7621 187.1997 201.0896 235.6360 276.8927 285.0503 298.0418 319.1258 350.7439 363.3008 372.8657 382.5652 387.1820 410.5749 440.9513 449.5406 457.3219 475.0441 496.5421 505.5332 562.3990 618.9020 631.3945 657.6595 674.8263 702.2946 710.4749 723.3762 746.8657 777.6665 794.0537 815.6554 820.7146 835.6358 862.9020 890.1480 930.1867 931.8426 943.1626 954.1328 980.2587 1006.7410 1067.5570 1079.3038 1095.4279 1127.5712 1133.4598 1162.6299 1176.7211 1185.9861 1222.8788 1258.8186 1263.4655 1272.9027 1298.4737 1309.5895 1329.9704 1346.7141 1357.1193 1385.3290 1392.2766 1405.1648 1474.1113 1508.7749 1591.2179 1648.5786 1684.2411 1736.5892 1781.7011 2987.2892 3198.0321 3219.9452 3239.1336 3264.0318 3277.3037 3282.8894 3551.6212 3623.4528 3633.5096 3676.8203 3693.1606 3868.3840 3878.3709
redmass: 5.0504 5.6906 6.9164 6.8578 8.1365 8.7098 4.8338 3.4124 3.0191 3.1181 6.8046 3.7931 5.5337 4.5180 3.8893 4.8707 4.1835 4.3146 2.9736 1.1964 1.5908 2.2457 3.4846 3.2113 3.9485 3.6216 2.1337 6.0037 2.4986 6.2321 3.9806 1.5421 1.6544 3.4157 1.4727 3.5347 3.2700 3.5328 1.7723 1.7522 2.3891 1.4435 1.3328 1.4058 3.9492 3.4972 3.1943 2.2655 1.7794 2.1300 1.3475 1.3317 3.9184 2.9442 1.3974 1.6968 2.2220 3.2802 1.2996 1.9414 1.6745 1.3237 1.5857 1.5139 1.8237 5.8786 2.2728 2.0435 1.8116 2.1208 1.6418 1.6104 2.3787 2.3164 1.2615 6.4091 4.4764 6.6441 7.5049 1.0820 1.0964 1.0879 1.1028 1.0945 1.0986 1.1011 1.0511 1.0659 1.0641 1.0965 1.0676 1.0671 1.0678
irintensity: 6.1905 0.5855 4.6441 3.1225 7.4791 5.1492 13.1996 10.5316 17.7414 14.1514 20.3013 15.8202 8.6530 8.7953 5.1584 19.3934 6.0416 15.0053 13.0713 49.9278 94.7666 49.6722 1.7034 28.4954 41.3384 5.3058 189.3024 66.6914 10.4090 17.1929 26.0050 117.6053 58.2882 24.4289 228.8406 69.0113 11.8692 31.8997 25.8871 80.5460 95.7977 52.9399 54.5000 25.6358 20.3975 188.0952 52.9594 265.0092 44.8532 273.8716 3.2540 54.3194 116.6105 70.1850 24.0284 57.8234 5.1516 153.7124 175.1967 22.7213 454.3532 54.9299 75.5198 43.4615 2.0639 188.8279 33.0544 90.2167 46.7925 258.9850 43.8094 26.4664 328.4105 105.7946 8.1777 443.3447 158.6495 334.5010 82.3701 1.9937 27.7467 7.5986 2.1232 32.8947 6.2146 13.8022 91.7180 398.7808 203.5046 86.9499 416.6306 289.1954 183.0154
temp: 298.150 k
press: 1.00000 atm
elementType: 6 1 6 6 1 6 1 6 1 6 1 7 7 7 1 1 6 1 8 1 8 1 8 8 1 8 1 15 8 6 1 8 1
symmnumber: 1
zpe: 659303.5 jmol-1
zpe.correction: 0.251115 hartree
zpe.thermalcorrener: 0.270265 hartree
zpe.thermalcorrenthalpy: 0.271209 hartree
zpe.thermalcorrgfe: 0.203726 hartree
zpe.sumelectzpe: -1343.694620 hartree
zpe.sumelectthermal: -1343.675471 hartree
zpe.sumelectthermalent: -1343.674526 hartree
zpe.sumelectthermalfe: -1343.742010 hartree
dipole: 4.1977 -2.1918 -1.7113
dipole: 5.0352
quadrupole: -66.2479 -103.0941 -103.7636
quadrupole: -3.4211 14.2187 0.1316
quadrupole: 24.7873 -12.0589 -12.7284 -3.4211 14.2187 0.1316
hfenergy: -1343.9457355 hartree
pointgroup: C01 [X(C8H14N3O7P1)]
dipole: 1.6871871 -0.7694078 -0.6969959 debye
polarizability: 188.0481062|23.6551713|131.5850322|-7.5427455|-1.7928357|135.3526233 unknown
InChI: InChI=1/C4H6N3O.C4H8O6P/c5-4-1-6-2-7(4)3-8;5-3-4(6)1-2-10-11(7,8)9/h1-3,8H,5H2;1-8H
charge 1 multiplicity 2
33 atoms
C  -2.53703516 -1.73462365 1.0006489
H  -3.6199142 -1.79777843 1.0798395
C  -1.78827119 -1.79402999 -0.146646
C  1.79592739 0.94388868 1.57042223
H  2.11388446 0.567273 2.54506522
C  -0.51250527 -1.66916299 1.72910728
H  0.39593939 -1.60083768 2.32630873
C  2.09903698 0.16377259 -0.81768379
H  1.24191935 0.62060177 -1.31375504
C  2.75037514 0.72328852 0.41960825
H  3.2244286 1.68872626 0.14167256
N  -1.72305566 -1.66927395 2.13040843
N  -0.4426571 -1.75169309 0.31053044
N  -2.09197468 -1.98222531 -1.45795105
H  -1.65433385 -1.31058505 -2.08775691
H  -3.0802792 -2.12113779 -1.63747883
C  0.64150856 1.60069513 1.49523564
H  -0.02788348 1.74926547 2.34612098
O  3.74015841 -0.23567611 0.74403012
H  4.42274094 0.15222742 1.30563264
O  2.87539678 -0.60139826 -1.58997218
H  3.68974158 -0.79944012 -1.08097239
O  0.23631159 2.17745746 0.31638444
O  -1.60248247 3.15737478 -0.96630695
H  -1.99623293 3.12805629 -1.8500665
O  -2.09754101 1.41189962 0.80588988
H  -2.43351404 0.4960347 0.823184
P  -1.14290618 1.75498376 -0.41181145
O  -0.96722927 0.67307877 -1.41051322
C  0.69958403 -1.84103419 -0.3719299
H  1.61732548 -1.97659868 0.21159665
O  0.66402688 -2.06785259 -1.63973119
H  1.55936613 -1.96457435 -2.0261755
