program: Gaussian 16
title: Title Card Required
version: ES64L-G16RevC.01
frameworkgroup: C1[X(C10H19N3O7P)]
method: UM062X
basis: def2SVP
operation: Freq
keyword: #N
keyword: Geom=AllCheck
keyword: Guess=TCheck
keyword: SCRF=Check
keyword: GenChk
keyword: UM062X/def2SVP
keyword: Freq
converged: YES YES YES YES
elementType: C
elementType: O
elementType: H
elementType: P
elementType: N
1716.lowfreq: -1603.5847 -1.5074 0.0012 0.0015 0.0020 3.5312 7.0361 19.1593 30.2812
frequency: -1603.5847 19.0194 30.2406 36.9233 49.3349 52.9535 82.2604 97.5300 116.5699 121.2741 133.6899 139.6664 168.9997 180.0320 196.7931 217.4566 229.9158 230.7202 257.0157 274.4291 278.1149 295.0090 308.0179 334.4903 352.1033 384.2905 402.7466 419.5165 423.2879 461.0810 472.4632 494.6989 507.8972 523.0071 571.9995 610.4262 637.8858 649.7301 670.8003 689.6664 729.0560 760.2167 780.0062 827.5297 837.9935 862.5109 865.9460 876.3402 891.3473 903.7934 926.2504 929.1694 955.3099 963.8254 968.4915 1023.6001 1037.1519 1043.6869 1069.5805 1072.3974 1102.1048 1128.6965 1147.4273 1152.6265 1173.3995 1180.3884 1192.1070 1207.0375 1208.3703 1212.2767 1238.8943 1243.8857 1250.6070 1279.0267 1281.6872 1303.4613 1336.0806 1346.3525 1350.1393 1359.3693 1376.3422 1380.7943 1390.1352 1412.1498 1417.2061 1429.3177 1434.1936 1444.0756 1448.5748 1464.7517 1478.3848 1487.0197 1490.8839 1558.5480 1607.8495 1659.3404 3038.6383 3043.9757 3060.3257 3066.0698 3106.4003 3112.7945 3130.1376 3144.6524 3168.6013 3194.3154 3263.1260 3293.1106 3513.2895 3589.9031 3607.8160 3810.1524 3877.4519 3880.5570
redmass: 1.1190 6.3492 5.5969 4.7955 6.2303 5.4488 4.6394 4.8279 2.1338 5.4976 5.2849 5.5337 2.9588 1.8306 3.9218 1.3346 2.0651 1.2957 1.9944 3.0362 2.7677 4.8783 5.5165 4.6061 4.4409 2.9123 4.2144 3.4777 3.8368 4.3636 4.7296 1.4098 2.7022 2.2154 4.3384 4.1315 2.0839 3.7949 4.0039 3.3493 5.2652 1.1284 5.1713 4.6527 1.0770 1.3707 1.3053 1.4696 4.4519 1.3649 4.2170 2.8604 2.0735 2.8748 4.1228 1.2784 1.9419 2.0225 2.8110 2.1644 2.8484 2.9677 1.6746 1.5351 2.6597 1.6349 3.0336 2.5864 2.3311 1.6925 1.5885 2.8110 1.3146 1.3158 1.3809 1.2413 1.7423 3.8901 3.1631 1.6920 1.2904 1.2836 1.4900 1.1415 1.5786 2.1730 1.4455 1.7678 1.2776 1.0413 1.5421 1.0888 6.9940 3.8576 1.3600 4.1637 1.0856 1.0424 1.0869 1.0877 1.0574 1.0887 1.0936 1.0878 1.1052 1.1109 1.0988 1.0991 1.0560 1.0687 1.0875 1.0653 1.0657 1.0669
irintensity: 258.3888 0.8499 0.8213 3.5874 0.2429 1.7760 0.7921 1.7898 0.1509 4.7989 12.1816 3.5278 12.2219 63.4962 4.2653 11.9349 18.7575 3.9048 41.0101 7.6547 7.5526 0.5566 1.9727 7.5602 7.4868 80.7616 8.4718 5.4297 30.0894 90.3056 22.0868 161.3044 11.2334 23.5736 26.0106 8.8049 4.1969 7.9678 4.2674 18.7159 17.8974 75.3053 21.1511 32.0032 6.7335 17.3406 21.3038 1.4544 8.3194 75.5718 254.5089 26.4087 41.3123 22.4422 462.7131 61.4696 50.5329 34.5888 6.2265 0.8201 36.9680 43.9539 38.3202 24.5913 7.5345 55.6373 286.7257 86.8674 34.9711 83.0351 86.1853 50.0798 22.3169 14.6599 36.0856 35.9675 53.9792 37.6886 162.7950 19.5116 12.2203 3.8283 126.7035 0.8029 31.0948 13.2747 7.7233 26.0853 13.3942 2.8027 29.4948 10.7085 20.2886 117.1618 10.8287 41.2411 10.6451 24.8713 33.6246 38.9243 12.9263 1.2331 8.0536 20.4578 0.4293 21.8568 5.4604 2.4291 48.9174 575.7693 35.9228 100.3264 215.8231 136.9095
temp: 298.150 k
press: 1.00000 atm
elementType: 6 8 6 6 6 1 1 1 1 8 1 8 1 6 1 8 15 8 8 1 8 1 7 6 6 6 1 1 7 7 1 1 6 1 1 6 1 1 1 1
symmnumber: 1
zpe: 828540.1 jmol-1
zpe.correction: 0.315574 hartree
zpe.thermalcorrener: 0.337932 hartree
zpe.thermalcorrenthalpy: 0.338876 hartree
zpe.thermalcorrgfe: 0.261919 hartree
zpe.sumelectzpe: -1422.987465 hartree
zpe.sumelectthermal: -1422.965107 hartree
zpe.sumelectthermalent: -1422.964162 hartree
zpe.sumelectthermalfe: -1423.041120 hartree
dipole: -1.6149 -2.7766 -0.1808
dipole: 3.2172
quadrupole: -98.7359 -136.0784 -140.2580
quadrupole: 16.6328 -3.1347 2.5576
quadrupole: 26.2882 -11.0543 -15.2339 16.6328 -3.1347 2.5576
hfenergy: -1423.3030388 hartree
pointgroup: C01 [X(C10H19N3O7P1)]
dipole: -0.6362576 -1.0917144 -0.0737163 debye
polarizability: 186.4002307|4.1318114|171.2730308|8.5548555|-0.7091486|125.4374437 unknown
InChI: InChI=1/C10H19N3O7P/c1-2-22-10(20-21(16,17)18)8-6(14)7(15)9(19-8)13-4-12-3-5(13)11/h3-4,6-10,14-17H,2,11H2,1H3
charge 0 multiplicity 2
40 atoms
C  0.41161551 -0.48460445 0.52592874
O  -0.71537871 0.28805583 0.94532127
C  -1.90973463 -0.36629869 0.64940265
C  -1.55256075 -1.52374308 -0.30278401
C  -0.14172615 -1.86609049 0.17892808
H  1.12541864 -0.56489787 1.3604719
H  -2.36899023 -0.78047161 1.56449871
H  -1.52145539 -1.12709114 -1.33488727
H  0.46492764 -2.3587924 -0.60090052
O  -0.22999832 -2.63113972 1.34650956
H  -0.97611686 -3.23497228 1.21443703
O  -2.38398139 -2.63366606 -0.18432015
H  -3.30286815 -2.2998185 -0.21361737
C  1.06200033 0.22974807 -0.63688073
H  0.39650676 0.41916511 -1.48965818
O  2.21943705 -0.42973099 -1.09164956
P  3.63470255 -0.18202981 -0.38499162
O  3.61090676 -0.00536297 1.07732033
O  4.48769483 -1.41982738 -0.92324057
H  4.48207079 -2.15392435 -0.29423444
O  4.22439609 1.03968924 -1.23072763
H  4.87823404 1.53912889 -0.72296748
N  -2.82906833 0.59480511 0.05660974
C  -4.12971122 0.33721951 -0.31258806
C  -2.57431642 1.89024014 -0.28649283
C  -4.5907423 1.50762725 -0.87068047
H  -1.61123498 2.34980012 -0.07739582
H  -5.57764586 1.69561582 -1.28955197
N  -3.6116642 2.45802974 -0.8492971
N  -4.68954745 -0.95286113 -0.12783767
H  -5.18703639 -1.02357458 0.76127859
H  -5.36298064 -1.15404024 -0.86416693
C  1.64882184 2.6317268 0.4632242
H  2.64729359 2.8606746 0.06982556
H  0.88876883 3.30028261 0.03774317
C  1.5643971 2.39523587 1.94842263
H  1.75409227 3.32643659 2.50902822
H  0.5663978 2.03213876 2.23280518
H  2.31107847 1.6515733 2.25904407
H  1.36345344 1.45710541 -0.15231726
