program: Gaussian 09
title: 000063212
version: EM64L-G09RevD.01
frameworkgroup: C1[X(C10H8N2O2)]
method: RPBEPBE
basis: SDD
operation: Freq
keyword: #p
keyword: freq=noraman
keyword: PBEPBE/SDD
title: #p freq=noraman PBEPBE/SDD
converged: YES YES NO NO
title: Mulliken charges:
elementType: O O N N C C C C C C C C C C H H H H H H H H
charge: -0.210868 -0.224606 -0.419254 0.022914 0.393624 0.060479 -0.007653 -0.387535 -0.322687 -0.046143 -0.191478 -0.246079 0.182148 -0.731257 0.348836 0.243310 0.280336 0.237590 0.239318 0.267156 0.246838 0.265012
chargesum: 0.00000
title: Mulliken charges with hydrogens summed into heavy atoms:
elementType: O O N N C C C C C C C C C C
charge: -0.210868 -0.224606 -0.070419 0.022914 0.393624 0.060479 -0.007653 -0.144225 -0.042351 -0.046143 0.046112 -0.006761 0.182148 0.047748
polarizability: 1.85863997e+02 5.41693192e+00 1.49214224e+02 3.70835841e-03 6.02722030e-02 5.40030597e+01
1716.lowfreq: -0.0004 -0.0003 0.0007 4.9853 8.6865 11.8615 50.7860 70.6992 97.8298
frequency: 50.7358 70.6782 97.8162 130.8104 151.5723 185.0729 262.4617 276.5307 312.4450 397.3948 422.9840 477.6977 487.1983 508.8832 539.5566 555.2252 619.3940 631.1034 680.9258 696.8467 731.7570 761.0201 787.6877 805.2526 844.7936 884.8705 935.3358 974.4285 975.6158 999.9092 1005.5419 1020.2154 1034.3787 1106.7652 1146.8187 1170.5242 1206.9981 1257.7193 1264.9092 1306.2831 1379.9770 1398.9868 1419.7997 1428.8179 1430.4516 1467.3926 1491.1261 1541.5176 1584.8475 1595.3935 1609.6437 1623.1891 3000.9387 3080.6653 3133.3046 3138.3880 3146.7035 3159.1623 3173.7221 3456.4107
redmass: 2.1215 1.7963 2.9715 6.5192 4.8559 5.7776 5.0576 5.1664 5.6162 6.6815 3.4745 4.1172 6.5921 8.0586 3.3816 6.0864 6.5131 5.2178 3.6426 4.0231 7.0080 1.2233 1.8676 2.1311 5.6677 1.5281 7.1740 1.3695 1.9983 5.3249 1.3408 1.8296 2.1405 2.2132 2.4394 1.1067 2.5714 1.9139 1.9007 2.8606 1.2807 9.7631 2.3932 1.0543 1.0991 2.8035 3.2556 6.0277 9.7950 7.8255 6.9802 6.9538 1.0368 1.0939 1.0874 1.1026 1.0898 1.0945 1.1003 1.0773
irintensity: 7.8595 0.1448 1.1698 0.2934 11.1749 1.7834 2.6168 7.6163 4.2413 2.0875 1.7841 0.3030 4.5765 6.2864 11.3248 12.8492 7.2419 4.1551 22.4702 3.3937 3.4547 0.0305 127.5843 46.4416 0.0800 2.1353 12.8252 3.8687 7.0157 38.8822 0.5624 4.9882 3.5239 14.3821 32.6686 7.3422 103.7687 31.0295 0.0067 77.9339 112.9430 8.2161 25.5975 22.6767 26.6069 64.7905 88.8514 187.2412 3.1297 267.8529 17.9147 64.8088 0.6793 2.0187 2.1056 19.0578 8.7206 5.4086 21.0721 106.9368
temp: 298.150 k
press: 1.00000 atm
elementType: 8 8 7 7 6 6 6 6 6 6 6 6 6 6 1 1 1 1 1 1 1 1
symmnumber: 1
zpe: 424893.2 jmol-1
zpe.correction: 0.161833 hartree
zpe.thermalcorrener: 0.173381 hartree
zpe.thermalcorrenthalpy: 0.174325 hartree
zpe.thermalcorrgfe: 0.123562 hartree
zpe.sumelectzpe: -644.857438 hartree
zpe.sumelectthermal: -644.845891 hartree
zpe.sumelectthermalent: -644.844946 hartree
zpe.sumelectthermalfe: -644.895710 hartree
dipole: -1.6263 -4.4295 0.0150
dipole: 4.7186
quadrupole: -66.7729 -91.9245 -81.6610
quadrupole: 8.5550 0.0446 0.0198
quadrupole: 13.3466 -11.8050 -1.5415 8.5550 0.0446 0.0198
hfenergy: -645.0192717 hartree
pointgroup: C01 [X(C10H8N2O2)]
dipole: 0.703212 1.6373706 -0.5204625 debye
dipolederiv: -0.4443937 0.1691721 -0.0331578 -0.0399198 -1.0967123 0.2034231 0.0221994 0.1772629 -0.4016306 -0.8046671 0.0542967 0.0510675 0.2518026 -0.8012152 0.1051479 -0.0005941 0.1285031 -0.3309997 -0.9849115 -0.1444525 0.1396846 0.0226175 -0.5979031 0.1046487 0.0947559 0.1259044 -0.2392647 -0.5577952 0.5502943 -0.1052652 -0.1289805 -0.7609192 0.1557783 0.0747603 0.0706282 -0.2648349 0.6844636 -0.1340466 -0.0398746 -0.0266258 0.1021964 -0.0002091 -0.0681218 0.0133656 0.0935814 -0.2859947 -0.2687836 0.1078473 -0.1158793 -0.3518742 0.1080427 0.0668971 0.1274031 -0.0445306 -0.0816766 0.294077 -0.0563403 0.5489794 0.761489 -0.2484632 -0.1240035 -0.2160008 0.1669633 -0.2482091 0.0672915 -0.0099862 -0.0694618 0.0927407 -0.065571 0.02654 -0.0830899 -0.1668962 -0.0337707 0.1467002 -0.0470644 -0.1489422 0.093677 -0.0319111 0.0313513 -0.0695704 -0.0823547 0.8333875 -0.3290047 0.0092926 0.0001861 1.374247 -0.3082024 -0.0775738 -0.2669423 0.2977157 0.0763472 -0.047068 -0.012369 0.1307913 0.1922068 -0.1000334 -0.0598506 -0.0773278 -0.0923096 0.0658871 -0.153155 0.0112833 -0.103549 -0.2314497 0.0302012 -0.0020824 0.0365338 -0.1768797 1.5873483 -0.0793417 -0.1695645 -0.116275 0.9009024 -0.1951893 -0.16245 -0.198141 0.2040384 -0.332089 -0.1868062 0.0963775 -0.3548559 -0.2384672 0.10936 0.1516828 0.0897721 -0.0565368 0.3251961 -0.0283032 0.0061675 -0.084569 0.2505793 0.0288757 0.0216023 0.021807 0.3096058 0.0645081 0.0835893 -0.0084044 0.0355508 -0.0480802 0.0548915 0.0044191 0.0488619 0.1607573 0.1102011 -0.0137668 0.0092673 0.0618706 0.0222695 0.0274256 -0.0108754 0.037075 0.145901 -0.0138386 -0.0919283 0.0460862 -0.0965363 0.0180121 0.0490992 0.0473073 0.0484939 0.1372012 -0.096948 0.0487822 0.0204227 0.0514421 0.0799956 0.0165417 0.0197952 0.0168607 0.1594441 0.1210214 0.0118099 0.0395674 0.035016 0.0531853 -0.0859223 0.0074614 -0.0873179 0.060361 -0.0830062 0.0521668 0.0084228 0.1141084 0.0540552 0.007737 -0.0111121 0.0134503 0.1231909 0.0989403 -0.0015233 -0.0634602 0.0332298 0.1310648 0.0343292 -0.0521084 0.0424682 -0.0025226 unknown
polarizability: 184.2460224|-0.3544931|142.4054713|-16.5538871|-23.5968965|62.429787 unknown
InChI: InChI=1S/C10H8N2O2/c1-6(13)9-11-8-5-3-2-4-7(8)10(14)12-9/h2-5,11H,1H3
charge 0 multiplicity 1
22 atoms
O  0.373433 -2.615887 0.953052
O  -2.993183 2.153362 0.110911
N  -0.468791 1.280438 0.020722
N  -1.215176 -0.908267 0.70017
C  0.879156 0.910496 -0.051485
C  1.203736 -0.444585 0.268695
C  -1.432631 0.361755 0.388741
C  1.889702 1.833699 -0.426073
C  2.558884 -0.855209 0.206337
C  0.129941 -1.410857 0.662751
C  3.225264 1.399382 -0.479606
C  3.564776 0.054736 -0.163999
C  -2.841651 0.934601 0.417225
C  -3.962975 0.012762 0.811139
H  -0.80171 2.230126 -0.191349
H  1.627631 2.869528 -0.669495
H  2.784263 -1.897108 0.455939
H  4.011079 2.105835 -0.767661
H  4.609799 -0.26776 -0.210557
H  -3.973183 -0.875993 0.155229
H  -4.923955 0.545803 0.763416
H  -3.787706 -0.380455 1.829097
