program: Gaussian 09
title: 000063192
version: EM64L-G09RevD.01
frameworkgroup: C1[X(C25H24N2O5)]
method: RPBEPBE
basis: SDD
operation: Freq
keyword: #p
keyword: freq=noraman
keyword: PBEPBE/SDD
title: #p freq=noraman PBEPBE/SDD
converged: YES YES NO NO
title: Mulliken charges:
elementType: O O O O O N N C C C C C C C C C C C C C C C C C C C C C C C C C H H H H H H H H H H H H H H H H H H H H H H H H
charge: -0.249012 -0.296303 -0.261672 -0.256937 -0.265125 -0.278705 -0.211575 -0.322360 0.409383 0.337454 0.122568 0.065120 0.493063 0.215239 0.176821 -0.323530 -0.279266 -0.347707 -0.331339 -0.370061 -0.226032 -0.513221 -0.251300 -0.413855 -0.836559 0.331486 -0.365729 -0.357420 0.325592 -0.531182 -0.537241 -0.538159 0.270464 0.286511 0.249424 0.275722 0.266458 0.222580 0.228469 0.255609 0.231255 0.256580 0.235901 0.270215 0.266678 0.241946 0.251004 0.222696 0.229000 0.245590 0.250777 0.220875 0.218860 0.224653 0.221134 0.245163
chargesum: 0.00000
title: Mulliken charges with hydrogens summed into heavy atoms:
elementType: O O O O O N N C C C C C C C C C C C C C C C C C C C C C C C C C
charge: -0.249012 -0.296303 -0.261672 -0.256937 -0.265125 -0.278705 -0.211575 -0.051895 0.409383 0.337454 0.122568 0.065120 0.493063 0.215239 0.176821 -0.037019 -0.029842 -0.071985 -0.064881 -0.147481 0.002437 -0.257612 -0.020045 -0.157275 -0.063765 0.331486 -0.123782 -0.106416 0.325592 0.166104 0.153271 0.152791
polarizability: 3.67844875e+02 -3.34606863e+01 2.67603882e+02 -8.34069223e-01 7.25365015e+00 3.06756447e+02
1716.lowfreq: -8.1498 -3.7693 -0.0005 -0.0002 0.0004 4.3287 11.9463 22.1065 36.2246
frequency: 11.8143 22.0840 36.2046 36.4446 46.0322 52.2202 69.5260 73.8939 94.2846 98.5170 113.4545 116.8829 136.3604 148.5051 152.2415 169.6477 176.4743 182.0801 209.4788 215.8870 219.8751 228.0033 232.3343 236.6900 270.6936 277.8220 289.9697 311.3272 318.1486 352.9082 362.7577 381.7716 397.6727 408.2533 413.5173 434.6983 453.2293 457.2517 473.8614 491.8761 495.8417 516.7730 522.3687 525.0528 543.8270 545.6380 581.3597 603.8390 621.0255 632.5770 637.2935 651.9206 682.3771 693.8102 707.8452 721.0538 738.3154 759.8841 772.8526 779.1091 784.9474 801.5486 804.4152 823.9295 827.8953 831.4525 853.5357 880.1267 894.1076 923.1968 931.3794 945.0244 955.6638 964.5926 987.5801 987.9895 994.3226 998.9191 1008.6920 1014.7048 1026.5714 1035.3418 1052.0220 1091.0455 1103.2618 1106.0431 1111.3779 1111.4361 1112.5743 1117.5125 1147.1688 1151.9736 1156.4720 1158.9658 1171.3915 1172.4428 1181.5416 1189.2960 1218.7657 1224.8896 1237.0943 1244.8078 1261.2621 1278.8013 1291.1581 1293.5713 1305.7848 1359.3748 1362.4990 1373.7340 1381.7560 1389.2655 1394.4493 1407.4892 1425.0194 1432.7777 1435.5974 1446.5440 1447.0750 1462.5534 1465.6786 1466.1848 1468.3112 1469.0913 1472.3388 1473.6259 1474.8947 1483.6761 1500.0378 1500.8175 1561.0132 1583.1748 1590.4722 1591.2190 1594.5654 1616.2258 1618.8671 1624.6374 2957.3969 2960.0360 2965.3314 2993.1724 3045.2375 3048.1361 3057.2989 3087.8331 3117.8981 3123.6525 3125.6777 3126.6628 3129.7969 3134.4070 3139.9455 3150.8767 3158.0694 3161.6994 3167.7777 3169.9583 3180.0597 3182.8039 3190.5065 3208.4742
redmass: 4.2910 5.3041 3.9833 4.4646 8.0375 6.0117 3.7062 5.6818 3.7104 4.0526 3.6882 3.8139 4.5030 4.9925 4.3043 3.3381 4.8549 1.6423 3.1153 2.5307 2.1043 1.2536 1.3480 1.8534 2.0059 3.4077 4.7941 4.8248 4.7638 7.4884 4.8813 5.0543 6.8658 4.8754 2.9695 4.0032 4.4395 3.5390 5.3254 4.5523 5.8878 3.5733 4.5030 3.5761 4.9905 4.2752 3.7134 4.8651 4.5656 6.6601 5.2606 4.8339 4.4791 5.2535 3.6942 3.9825 3.3063 3.9483 2.0588 4.1690 2.4948 1.3405 1.7174 1.8920 2.9379 2.2953 5.3252 1.4560 5.9286 3.2296 1.4418 1.3537 1.4075 1.3815 8.9773 8.9924 1.3412 2.9507 3.3794 2.0878 3.1183 1.6860 2.4880 3.4222 3.6248 2.2788 1.2603 1.2597 1.2697 1.4229 2.1409 1.4861 1.3294 1.3563 1.7715 1.1336 1.2559 2.1004 2.3706 3.0628 2.8083 3.2404 3.1877 2.0996 1.7448 1.4768 1.3229 2.2092 1.7804 6.3266 1.7826 5.5644 3.3321 3.2204 3.7893 1.1526 1.1736 2.5235 1.3762 1.1036 1.0504 1.0510 1.0509 1.1520 1.1553 1.6384 1.2259 1.1065 2.2885 2.4089 9.3651 7.3799 7.3063 7.7128 7.9640 6.9062 7.0776 6.6830 1.0332 1.0329 1.0324 1.0381 1.1040 1.1040 1.1042 1.0961 1.0842 1.1001 1.0994 1.0990 1.0990 1.0865 1.0879 1.0915 1.0891 1.0876 1.0986 1.0957 1.0909 1.0952 1.0952 1.0947
irintensity: 1.4654 0.0885 0.7031 0.5953 1.6587 2.9665 1.7050 1.6703 4.5300 5.3443 2.3487 2.3259 1.9458 0.7737 5.8215 0.2766 3.9749 1.6551 0.2816 1.4439 2.5726 1.0138 0.2977 1.1761 1.0469 2.4609 0.6775 5.7556 2.6169 12.5888 1.6265 4.0756 0.5988 1.8287 0.2599 1.3341 1.0470 4.5901 3.7908 2.9449 23.2118 10.0162 8.4197 9.6361 16.1559 14.6475 6.5299 6.1307 11.1036 4.6430 8.4316 5.4810 16.8324 3.7713 5.7192 3.3631 11.2954 26.9968 6.5403 10.7099 75.4248 0.0905 1.6683 33.8530 37.4043 60.4273 12.9761 0.4782 34.7758 15.5511 3.6173 0.6666 2.2039 3.3427 91.1032 31.0642 0.5354 6.9477 38.3023 8.8584 33.7583 11.1064 33.3903 39.3499 49.0888 38.3620 0.1956 0.2140 1.0324 11.9730 31.2509 23.0122 2.2956 1.6836 66.9585 14.6907 98.8155 6.9046 119.5777 82.2501 249.8512 101.3604 200.8210 56.8401 44.9840 60.0545 3.0998 114.9348 149.9197 29.2868 57.5577 9.3690 36.0630 9.6178 1.7020 20.7787 23.1864 58.0478 25.8661 54.5119 13.3720 0.3403 24.6481 76.0245 65.6300 40.4180 58.9589 12.9249 76.6976 270.1786 137.9523 9.1625 68.0259 89.6252 138.8916 170.0520 58.6662 74.7661 56.4302 74.1496 69.0913 11.5200 43.2823 46.4063 33.7676 7.4563 1.7242 15.5413 29.0787 21.4199 10.5793 5.1501 12.9147 13.0603 14.5383 4.6455 25.0411 5.9858 7.5544 1.7709 1.1515 1.7909
temp: 298.150 k
press: 1.00000 atm
elementType: 8 8 8 8 8 7 7 6 6 6 6 6 6 6 6 6 6 6 6 6 6 6 6 6 6 6 6 6 6 6 6 6 1 1 1 1 1 1 1 1 1 1 1 1 1 1 1 1 1 1 1 1 1 1 1 1
symmnumber: 1
zpe: 1149191.0 jmol-1
zpe.correction: 0.437704 hartree
zpe.thermalcorrener: 0.467214 hartree
zpe.thermalcorrenthalpy: 0.468158 hartree
zpe.thermalcorrgfe: 0.375948 hartree
zpe.sumelectzpe: -1450.376618 hartree
zpe.sumelectthermal: -1450.347108 hartree
zpe.sumelectthermalent: -1450.346164 hartree
zpe.sumelectthermalfe: -1450.438374 hartree
dipole: 1.3769 7.4671 1.5999
dipole: 7.7597
quadrupole: -159.2062 -185.4966 -178.3454
quadrupole: 8.7198 5.9176 9.8671
quadrupole: 15.1432 -11.1472 -3.9960 8.7198 5.9176 9.8671
hfenergy: -1450.8143213 hartree
pointgroup: C01 [X(C25H24N2O5)]
dipole: -1.5055677 -2.6511001 0.1586749 debye
polarizability: 360.9255167|-40.7714234|281.1587444|8.3486148|16.0156104|300.1209424 unknown
InChI: InChI=1S/C25H24N2O5/c1-16(28)26-22-8-6-5-7-20(22)25(29)27(17-9-11-18(30-2)12-10-17)24(26)21-14-13-19(31-3)15-23(21)32-4/h5-15,24H,1-4H3
charge 0 multiplicity 1
56 atoms
O  0.47993 2.917663 1.41185
O  0.11588 -2.683244 -1.639486
O  3.020934 -0.202296 -3.063736
O  -0.492682 -4.482908 2.943729
O  -5.577756 3.011213 -0.692904
N  -0.201455 1.256661 -0.107858
N  1.52725 0.007452 -1.279689
C  0.146743 -0.052881 -0.727417
C  -0.028224 -1.226395 0.254304
C  2.52225 0.361383 -0.308653
C  2.1141 1.270965 0.709817
C  0.749699 1.887048 0.719239
C  -1.565265 1.725813 -0.216321
C  1.825855 -0.160871 -2.650679
C  -0.026746 -2.55862 -0.244056
C  3.84956 -0.129088 -0.328635
C  -0.218761 -1.052447 1.644155
C  3.038024 1.672405 1.703914
C  -2.280788 2.172445 0.919484
C  -2.211873 1.737218 -1.480638
C  4.75521 0.280385 0.673174
C  -0.172982 -3.675852 0.611231
C  4.35608 1.178596 1.692819
C  -0.370616 -2.142194 2.519311
C  0.659065 -0.254581 -3.630035
C  -0.339954 -3.456739 2.001266
C  -3.615578 2.614552 0.803199
C  -3.545473 2.160813 -1.603779
C  -4.255976 2.602499 -0.460164
C  0.177866 -4.029451 -2.214683
C  -0.46002 -5.866015 2.464113
C  -6.345104 3.498099 0.456162
H  -0.536186 -0.217925 -1.57041
H  4.163677 -0.804118 -1.124639
H  -0.254161 -0.041272 2.057367
H  2.696581 2.389417 2.457313
H  -1.786877 2.20106 1.892665
H  -1.666786 1.440675 -2.383245
H  5.780211 -0.106539 0.655401
H  -0.162228 -4.689587 0.20562
H  5.068849 1.490843 2.463105
H  -0.511921 -1.998305 3.593438
H  0.051713 0.669457 -3.626727
H  0.005892 -1.114029 -3.405475
H  1.092453 -0.377977 -4.633479
H  -4.137972 2.961187 1.699502
H  -4.048544 2.1762 -2.575033
H  -0.763259 -4.585476 -2.038812
H  1.034804 -4.597836 -1.806404
H  0.32103 -3.875047 -3.294422
H  -0.585207 -6.484345 3.364821
H  0.50899 -6.102779 1.982657
H  -1.288648 -6.068395 1.757305
H  -5.870795 4.391279 0.907273
H  -6.460916 2.710497 1.226118
H  -7.330997 3.767288 0.049828
