program: Gaussian 09
title: 000063185
version: EM64L-G09RevD.01
frameworkgroup: C1[X(C22H16ClN5O)]
method: RPBEPBE
basis: SDD
operation: Freq
keyword: #p
keyword: freq=noraman
keyword: PBEPBE/SDD
title: #p freq=noraman PBEPBE/SDD
converged: YES YES NO NO
title: Mulliken charges:
elementType: Cl O N N N N N C C C C C C C C C C C C C C C C C C C C C C H H H H H H H H H H H H H H H H
charge: -0.025012 -0.213033 -0.280706 -0.037266 -0.116421 -0.079517 -0.070640 0.179989 0.029349 0.201920 0.157924 -0.336549 -0.347465 -0.757630 -0.246677 -0.210499 0.086029 0.409137 -0.286143 -0.337679 -0.224555 -0.229952 -0.220019 0.186724 -0.321533 -0.289341 -0.204197 -0.201275 -0.228839 0.274430 0.261013 0.242989 0.257044 0.251669 0.234089 0.233375 0.283647 0.257054 0.235755 0.237943 0.261839 0.278690 0.236218 0.233679 0.234443
chargesum: 0.00000
title: Mulliken charges with hydrogens summed into heavy atoms:
elementType: Cl O N N N N N C C C C C C C C C C C C C C C C C C C C C C
charge: -0.025012 -0.213033 -0.280706 -0.037266 -0.116421 -0.079517 -0.070640 0.179989 0.029349 0.201920 0.157924 -0.062120 -0.086453 -0.005928 -0.012588 0.022876 0.086029 0.409137 -0.286143 -0.054031 0.032499 0.005802 0.017924 0.186724 -0.059694 -0.010651 0.032021 0.032404 0.005604
polarizability: 4.61020750e+02 2.53407534e+01 3.46288265e+02 -1.69484745e+01 -8.74215034e+00 2.13163445e+02
1716.lowfreq: -7.7227 -4.5987 -0.0011 -0.0007 0.0009 4.0657 11.3702 20.6113 26.7029
frequency: 10.8583 20.5062 26.6986 32.5440 39.7976 52.0102 82.1040 94.6094 111.9076 124.0300 137.9333 159.6859 162.5424 173.7214 202.8570 223.8253 237.2175 262.4326 288.3359 296.9007 317.7154 326.6786 364.7942 370.2667 394.7517 405.7057 422.1844 432.8908 444.0717 454.2048 480.5920 499.7550 508.0088 526.1914 526.4193 539.4354 600.9045 608.2251 618.0470 626.0098 635.4909 640.9334 650.1797 675.1030 676.2389 688.7162 721.1044 728.8443 769.6941 779.4625 780.9356 784.4794 809.0435 846.1409 851.5776 857.6785 878.9843 895.7901 916.5478 944.5796 964.7826 977.8092 978.4514 985.3969 988.6195 999.3157 1001.6817 1003.1534 1006.7415 1016.2351 1021.8030 1028.9347 1043.9507 1048.8178 1069.5602 1082.0460 1098.6566 1113.3085 1135.0315 1159.0584 1164.0434 1172.8436 1173.0800 1200.6069 1212.5864 1236.2549 1248.8941 1273.9158 1294.5265 1309.0635 1312.6416 1342.1973 1373.9595 1389.4023 1390.2044 1393.9738 1412.4435 1425.4186 1443.1193 1443.5609 1452.1330 1455.3242 1458.1006 1466.2919 1471.9397 1563.1241 1567.9555 1569.4997 1580.7618 1602.8798 1604.4685 1613.9389 1631.7244 2998.8071 3077.7760 3132.6575 3134.6597 3137.1517 3140.9160 3144.2496 3149.1650 3154.9844 3156.6601 3163.9689 3166.6589 3170.5734 3173.5836 3174.0172 3179.0453
redmass: 8.3978 5.8908 5.0361 4.2978 5.7222 6.4650 7.0655 3.7848 4.9508 5.4298 5.7937 3.4699 2.6005 1.7987 5.9195 9.2996 6.9003 4.2828 5.5307 4.9357 4.5131 7.1522 7.0280 6.4005 9.6164 3.0908 5.7328 4.9979 4.9453 3.7094 7.1069 4.6541 3.5964 6.2041 4.3406 7.9027 5.8723 6.3778 5.3212 5.0340 6.6614 6.3548 6.0498 7.0709 5.5542 1.8964 5.3096 4.5143 1.3286 4.1747 1.7979 1.3450 6.5087 4.9733 1.2989 6.0033 1.4029 1.4738 8.4125 1.4334 1.3667 2.8634 1.4854 4.2635 1.5343 1.3449 1.3299 1.3460 6.2897 2.2022 2.3398 3.4032 1.5646 2.4061 2.1288 1.6182 2.2222 2.3232 2.3546 1.5495 1.1503 1.0602 1.0571 2.1847 2.4782 2.8563 1.6280 3.3831 2.2458 1.6289 2.5979 6.0388 7.9879 8.7435 8.7765 1.2785 8.2968 2.4221 1.9793 1.3608 1.8957 1.1622 2.5830 2.2782 2.8460 6.7856 6.4240 7.3271 6.0589 6.3329 6.8428 7.1199 11.0211 1.0379 1.0961 1.0855 1.0861 1.0998 1.0862 1.0888 1.0901 1.0930 1.0908 1.0955 1.0962 1.0944 1.0999 1.1009 1.1001
irintensity: 0.3086 0.3147 0.1511 0.5335 1.1956 2.1386 1.0333 1.3231 1.3597 2.3574 3.7211 0.4336 0.0870 0.5014 1.6649 1.4968 0.1449 5.3872 2.6051 0.9088 3.4788 2.9994 0.6348 1.8014 3.9116 1.3725 3.6751 7.2866 0.6830 2.8414 9.5682 8.5346 8.1447 2.0706 1.7576 2.9765 16.2344 0.6179 10.5907 21.7613 38.7845 32.2794 16.7438 14.7498 1.5122 36.7948 1.2847 8.8133 92.0487 7.3482 37.8510 77.3805 17.1617 9.0579 1.3617 13.1372 0.6974 0.8413 13.2789 2.8159 1.3216 15.4288 8.1064 2.9665 0.0148 0.3522 0.0120 0.0513 18.5758 2.7580 21.9747 45.4874 4.6190 7.9046 24.1269 22.7398 16.0302 45.6455 58.0615 13.7935 1.1022 0.3223 4.6717 6.5536 11.9344 20.2002 17.9223 85.2111 70.7666 34.3920 46.9678 100.6489 3.9554 8.8842 28.3297 38.4265 79.8487 25.4815 27.4497 8.6177 31.2682 9.8757 41.6003 24.8732 11.4172 20.9966 6.1596 215.6241 5.7338 4.5826 10.1821 57.1702 134.6506 6.3719 9.2270 1.0071 4.9589 10.1784 2.7544 7.2636 8.8681 16.3101 12.8645 10.1053 9.9666 2.4309 26.5093 32.0020 21.5915
temp: 298.150 k
press: 1.00000 atm
elementType: 17 8 7 7 7 7 7 6 6 6 6 6 6 6 6 6 6 6 6 6 6 6 6 6 6 6 6 6 6 1 1 1 1 1 1 1 1 1 1 1 1 1 1 1 1
symmnumber: 1
zpe: 867101.2 jmol-1
zpe.correction: 0.330261 hartree
zpe.thermalcorrener: 0.354529 hartree
zpe.thermalcorrenthalpy: 0.355473 hartree
zpe.thermalcorrgfe: 0.273116 hartree
zpe.sumelectzpe: -1654.934719 hartree
zpe.sumelectthermal: -1654.910452 hartree
zpe.sumelectthermalent: -1654.909508 hartree
zpe.sumelectthermalfe: -1654.991865 hartree
dipole: -0.1525 2.0759 1.8863
dipole: 2.8091
quadrupole: -140.2402 -156.9161 -174.9704
quadrupole: 11.2708 -9.3610 -0.4176
quadrupole: 17.1353 0.4595 -17.5948 11.2708 -9.3610 -0.4176
hfenergy: -1655.2649809 hartree
pointgroup: C01 [X(C22H16Cl1N5O1)]
dipole: -0.1203888 0.8458202 0.7010692 debye
polarizability: 462.1986067|25.9269241|345.4549668|2.8601802|-11.9722996|212.8188874 unknown
InChI: InChI=1S/C22H16ClN5O/c1-15-24-20-14-8-6-12-18(20)22(29)28(15)27-21(17-11-5-7-13-19(17)23)26-25-16-9-3-2-4-10-16/h2-14H,1H3
charge 0 multiplicity 1
45 atoms
Cl -3.481922 1.565581 -1.64954
O  0.404919 -1.29584 -1.66789
N  0.439797 -1.325985 0.696171
N  2.487386 -1.486321 1.946997
N  -0.955643 -1.484737 0.747182
N  -1.291542 0.805965 0.035498
N  -0.080056 1.197686 -0.229663
C  2.557217 -1.253745 -0.52889
C  3.205345 -1.349225 0.744102
C  1.088656 -1.277379 -0.612851
C  1.165156 -1.487024 1.904048
C  3.325557 -1.133053 -1.716492
C  4.62624 -1.322339 0.800446
C  0.360823 -1.638039 3.166489
C  4.728412 -1.105416 -1.644561
C  5.377428 -1.200231 -0.380617
C  -1.678203 -0.528084 0.111824
C  -3.106061 -0.839729 -0.155575
C  -4.002197 -0.0087 -0.879842
C  -3.62386 -2.079798 0.322892
C  -5.34891 -0.367309 -1.091659
C  -4.96404 -2.451335 0.121747
C  -5.836408 -1.589757 -0.584227
C  0.202558 2.562675 0.102636
C  1.54488 2.965999 -0.127028
C  -0.754879 3.490595 0.603163
C  1.936665 4.289212 0.159586
C  -0.354355 4.810897 0.878648
C  0.989113 5.213065 0.662101
H  2.795345 -1.063507 -2.67192
H  5.10223 -1.400755 1.782474
H  -0.270082 -0.749542 3.350049
H  1.057957 -1.773109 4.005648
H  -0.323143 -2.501983 3.096086
H  5.323776 -1.013768 -2.559058
H  6.47168 -1.180738 -0.329345
H  -2.929618 -2.737811 0.852577
H  -6.001523 0.303335 -1.657788
H  -5.32738 -3.409083 0.507796
H  -6.882085 -1.867026 -0.753123
H  2.251005 2.228517 -0.523056
H  -1.787619 3.160111 0.750978
H  2.972153 4.60186 -0.010305
H  -1.084193 5.534253 1.258462
H  1.29182 6.24342 0.879429
