program: Gaussian 09
title: 000063175
version: EM64L-G09RevD.01
frameworkgroup: C1[X(C27H20N4O)]
method: RPBEPBE
basis: SDD
operation: Freq
keyword: #p
keyword: freq=noraman
keyword: PBEPBE/SDD
title: #p freq=noraman PBEPBE/SDD
converged: YES YES NO NO
title: Mulliken charges:
elementType: O N N N N C C C C C C C C C C C C C C C C C C C C C C C C C C C H H H H H H H H H H H H H H H H H H H H
charge: -0.235873 -0.343351 -0.055914 -0.069768 -0.697353 0.007888 0.137709 0.102922 0.436498 0.067175 0.297201 -0.324050 -0.332728 -0.331270 -0.355440 -0.287279 -0.367330 -0.247044 -0.206902 -0.418978 -0.413246 -0.402070 -0.361169 0.249105 0.518636 -0.377752 0.433245 -0.368443 -0.371829 -0.231869 -0.220184 -0.229694 0.270994 0.261380 0.250001 0.259308 0.260889 0.268225 0.232088 0.231294 0.220268 0.219099 0.253706 0.241493 0.308403 0.307827 0.218120 0.227902 0.276205 0.230032 0.230364 0.231560
chargesum: 0.00000
title: Mulliken charges with hydrogens summed into heavy atoms:
elementType: O N N N N C C C C C C C C C C C C C C C C C C C C C C C C C C C
charge: -0.235873 -0.343351 -0.055914 -0.069768 -0.081124 0.007888 0.137709 0.102922 0.436498 0.067175 0.297201 -0.053056 -0.071349 -0.081269 -0.096132 -0.026391 -0.099104 -0.014957 0.024392 -0.198709 -0.194147 -0.148364 -0.119676 0.249105 0.518636 -0.159632 0.433245 -0.140541 -0.095624 -0.001837 0.010180 0.001865
polarizability: 6.60772027e+02 5.20005198e+01 3.55547597e+02 2.05822276e+01 -3.09495982e+01 2.12260383e+02
1716.lowfreq: -6.1778 0.0002 0.0005 0.0008 1.9322 3.8314 16.3362 23.0098 27.8642
frequency: 16.3010 22.9968 27.8434 32.2672 46.3179 61.1230 63.3341 66.9113 85.0879 116.1249 125.0325 138.9490 156.0067 172.0422 190.7794 218.6022 248.2355 253.9891 274.2895 302.1603 324.7333 339.2633 355.8468 369.3977 380.4233 386.2706 389.4070 405.0743 412.3637 413.2757 414.6465 453.0697 472.9053 502.6518 506.1976 516.6914 523.1682 530.9411 550.1562 550.5745 599.7610 614.3099 623.6844 633.5491 647.1385 652.4733 664.3928 679.6968 692.7286 699.1817 721.5788 746.5286 772.7979 780.6926 788.2477 792.4701 807.5310 815.7291 819.7360 828.4514 832.0295 839.0795 858.0917 861.8615 873.8016 893.3615 912.8193 930.9670 937.4541 949.6311 963.4533 973.9253 978.0698 981.8067 988.1657 988.9071 996.8054 1000.5677 1004.3446 1008.1233 1015.0759 1019.1035 1021.8674 1048.7328 1080.1996 1099.8272 1104.3428 1119.2402 1132.3036 1163.5845 1165.7085 1172.7604 1180.4440 1185.2139 1199.8622 1210.7621 1230.1914 1249.2495 1255.7911 1280.1785 1301.6404 1305.8913 1313.3653 1319.2627 1327.2543 1351.4863 1368.0430 1385.8594 1393.5303 1397.2733 1419.7716 1439.8889 1440.1621 1448.8745 1457.6299 1479.8390 1495.4704 1507.8685 1518.0321 1556.9745 1562.5522 1574.1575 1583.8573 1592.4772 1607.4508 1613.0716 1617.5424 1624.1052 1631.7503 1646.1802 2944.4040 3117.5144 3125.6879 3129.0638 3130.1965 3133.1875 3134.4693 3143.7200 3148.4411 3153.9234 3155.3421 3157.8244 3163.5479 3166.1527 3168.5114 3172.7390 3173.1817 3179.0079 3566.9698 3706.6392
redmass: 6.0805 4.5202 4.8606 5.8563 5.6120 4.8418 3.8694 4.3213 5.0890 5.7549 6.1673 5.5602 5.3173 5.8986 5.7575 6.0109 5.6642 3.7653 4.1002 5.9667 5.9566 5.6235 4.4467 1.3650 1.0759 4.1360 4.5795 2.8441 3.0356 2.7411 3.5454 3.9134 4.6513 7.8782 4.6053 5.2612 2.6895 3.7719 7.0829 3.2827 6.0820 6.4479 6.7137 6.3601 5.9836 6.4672 6.6027 4.6740 4.7304 1.8356 3.8362 3.7588 1.7847 1.6959 3.2475 4.1022 1.2861 5.1960 2.3267 1.6119 3.8085 1.6389 1.2504 4.3042 3.6984 1.4994 6.9383 1.3716 1.4049 1.3563 1.3752 1.3787 1.3730 1.5912 4.0766 1.5878 3.4170 1.3331 2.7756 1.3622 2.4746 1.4589 2.1361 2.9562 1.5841 2.9100 2.4828 1.3535 1.2391 1.5118 1.3208 1.0726 1.1101 1.1242 1.5790 2.2199 3.6228 2.0026 2.5162 2.6456 1.3339 1.5285 1.4571 2.3753 3.5362 2.9612 2.4970 5.7352 10.3770 4.0697 4.2074 2.7831 2.7846 2.7280 2.7018 2.3574 2.9095 5.0425 4.2970 7.0643 7.1208 6.6371 7.2450 5.9515 9.6365 6.2436 7.4901 6.6294 3.0049 1.4676 1.0861 1.0876 1.0885 1.0893 1.0869 1.0861 1.0885 1.0919 1.0899 1.0963 1.0885 1.0959 1.0953 1.0948 1.1006 1.0999 1.0955 1.0963 1.0449 1.1040
irintensity: 0.1294 0.5497 0.4700 1.9213 1.0722 0.3409 1.4218 0.3909 0.7132 1.1593 1.1310 3.0958 0.1131 3.0436 1.8634 1.8123 2.3443 20.8266 1.4379 2.7270 2.3574 1.3899 1.7238 227.0036 4.2711 41.1608 24.0243 0.2247 5.7924 0.1869 1.0023 6.4454 1.9539 0.3440 4.3310 3.8967 16.5023 10.6699 3.1724 21.4801 16.0440 0.3958 9.4185 5.4880 24.5024 2.2229 7.7231 7.0744 8.6668 51.4740 2.0715 4.5078 33.9563 66.4188 26.8823 0.9826 1.6724 2.3391 60.2612 38.0966 17.4021 32.5164 0.3216 18.8267 25.7375 0.8370 7.0357 2.6506 3.7385 1.4586 2.9744 2.0550 2.8608 24.3390 1.1397 1.9798 3.0953 0.0470 9.2670 3.8649 22.2402 0.3664 8.1474 6.3599 10.9612 2.0773 48.0008 9.6087 22.8971 63.4270 51.0336 0.4564 5.1420 37.2071 2.7580 11.0046 77.2758 14.0656 9.3053 49.3188 3.2393 44.2981 16.1286 116.9599 29.1268 6.8682 5.9042 10.9818 65.3879 5.1329 17.3850 5.6567 14.0811 1.4583 91.9837 5.0096 138.4826 437.1287 111.5857 21.2235 1.8013 115.1955 7.4266 57.6916 242.0006 14.7588 38.9167 22.2263 30.6813 322.4650 45.6278 7.7416 11.3843 32.7114 0.0109 5.0860 9.7570 22.0362 10.4990 7.9174 5.1327 26.9488 12.9730 4.4434 36.8085 34.2960 2.0802 4.2233 99.5892 21.4115
temp: 298.150 k
press: 1.00000 atm
elementType: 8 7 7 7 7 6 6 6 6 6 6 6 6 6 6 6 6 6 6 6 6 6 6 6 6 6 6 6 6 6 6 6 1 1 1 1 1 1 1 1 1 1 1 1 1 1 1 1 1 1 1 1
symmnumber: 1
zpe: 1050055.8 jmol-1
zpe.correction: 0.399945 hartree
zpe.thermalcorrener: 0.425918 hartree
zpe.thermalcorrenthalpy: 0.426862 hartree
zpe.thermalcorrgfe: 0.341349 hartree
zpe.sumelectzpe: -1332.961949 hartree
zpe.sumelectthermal: -1332.935976 hartree
zpe.sumelectthermalent: -1332.935032 hartree
zpe.sumelectthermalfe: -1333.020544 hartree
dipole: 4.1409 2.2731 2.0059
dipole: 5.1320
quadrupole: -169.9224 -152.6565 -175.2441
quadrupole: 10.4197 7.2254 -5.6443
quadrupole: -3.9814 13.2845 -9.3031 10.4197 7.2254 -5.6443
hfenergy: -1333.3618936 hartree
pointgroup: C01 [X(C27H20N4O1)]
dipole: -1.7009734 0.927626 -0.5682639 debye
polarizability: 667.5727596|-27.3236368|320.9631695|13.838866|63.6052666|240.0440779 unknown
InChI: InChI=1S/C27H20N4O/c28-21-12-16-23(17-13-21)31-26(30-25-9-5-4-8-24(25)27(31)32)20-10-14-22(15-11-20)29-18-19-6-2-1-3-7-19/h1-18H,28H2
charge 0 multiplicity 1
52 atoms
O  4.838167 1.554414 0.878815
N  2.737125 0.617343 0.337404
N  2.557591 -1.634889 -0.519997
N  -3.751471 -0.842983 0.359066
N  0.332209 5.733777 1.038188
C  1.987705 -0.520792 -0.063655
C  4.789382 -0.684819 -0.044634
C  4.182909 0.566369 0.439907
C  2.115512 1.92037 0.529283
C  3.952717 -1.727465 -0.552996
C  0.49906 -0.528814 0.037909
C  6.200973 -0.834249 -0.047674
C  2.266778 2.618602 1.748801
C  1.390875 2.514694 -0.529056
C  4.553197 -2.911555 -1.069055
C  -0.219482 0.096136 1.095742
C  -0.226719 -1.301546 -0.909375
C  6.780276 -2.00722 -0.558531
C  5.950553 -3.045793 -1.072472
C  1.675066 3.88186 1.921068
C  0.791687 3.775708 -0.363387
C  -1.615008 -0.033882 1.186876
C  -1.625858 -1.406243 -0.841878
C  -2.346605 -0.754721 0.202839
C  0.921809 4.482009 0.868477
C  -4.559094 -0.879294 -0.673296
C  -6.012959 -1.060287 -0.527896
C  -6.835563 -1.067958 -1.687966
C  -6.614163 -1.229527 0.75176
C  -8.231396 -1.241776 -1.575097
C  -8.006891 -1.401849 0.861827
C  -8.820461 -1.408833 -0.299986
H  6.809055 -0.013956 0.347335
H  2.85883 2.178863 2.555813
H  1.292012 1.985703 -1.482895
H  3.89528 -3.700496 -1.445748
H  0.311772 0.667756 1.860645
H  0.337535 -1.831604 -1.682349
H  7.868947 -2.125994 -0.563175
H  6.408351 -3.959058 -1.468759
H  1.802668 4.415627 2.870385
H  0.226729 4.221817 -1.19041
H  -2.168754 0.424482 2.011815
H  -2.161601 -2.026132 -1.569916
H  0.437808 6.246104 1.908724
H  -0.196194 6.167612 0.287178
H  -4.189938 -0.750616 -1.713917
H  -6.376187 -0.937335 -2.676244
H  -5.965229 -1.220826 1.633406
H  -8.85783 -1.246922 -2.473785
H  -8.465577 -1.531829 1.848388
H  -9.904197 -1.54388 -0.210002
