program: Gaussian 09
title: 000063174
version: EM64L-G09RevD.01
frameworkgroup: C1[X(C27H18N4O3)]
method: RPBEPBE
basis: SDD
operation: Freq
keyword: #p
keyword: freq=noraman
keyword: PBEPBE/SDD
title: #p freq=noraman PBEPBE/SDD
converged: YES YES NO NO
title: Mulliken charges:
elementType: O O O N N N N C C C C C C C C C C C C C C C C C C C C C C C C C C C H H H H H H H H H H H H H H H H H H
charge: -0.230008 -0.207412 -0.205577 -0.351917 -0.041807 -0.069032 0.023045 0.010218 0.139386 0.113155 0.438563 0.069702 0.299144 -0.317686 -0.309945 -0.310197 -0.351835 -0.367576 -0.295223 -0.243255 -0.203029 -0.359328 -0.365095 -0.360368 -0.394723 0.394994 0.253660 -0.376775 0.434857 -0.365203 -0.368729 -0.230480 -0.218711 -0.226495 0.273439 0.269807 0.282641 0.263226 0.268104 0.253606 0.237363 0.236410 0.288267 0.289294 0.246766 0.258763 0.222151 0.229181 0.275732 0.232449 0.232627 0.233856
chargesum: 0.00000
title: Mulliken charges with hydrogens summed into heavy atoms:
elementType: O O O N N N N C C C C C C C C C C C C C C C C C C C C C C C C C C C
charge: -0.230008 -0.207412 -0.205577 -0.351917 -0.041807 -0.069032 0.023045 0.010218 0.139386 0.113155 0.438563 0.069702 0.299144 -0.044247 -0.040138 -0.027556 -0.088608 -0.099472 -0.041617 -0.005893 0.033381 -0.071061 -0.075801 -0.113602 -0.135960 0.394994 0.253660 -0.154624 0.434857 -0.136022 -0.092997 0.001968 0.013915 0.007361
polarizability: 6.67686710e+02 -6.38404426e+01 3.77663805e+02 -2.38277526e+01 -3.38385186e+01 2.26971288e+02
1716.lowfreq: -5.2068 -3.5834 -0.0009 -0.0006 0.0002 2.8180 13.7711 21.4334 27.1281
frequency: 13.7608 21.4097 27.1198 28.8770 40.7632 45.4200 59.6310 63.2964 80.7009 88.0199 113.6832 121.9639 130.4300 140.1815 166.7000 176.7681 197.5240 233.1661 251.3664 257.1912 275.9103 297.7526 317.3492 345.5408 350.3985 384.1592 397.4635 404.5723 412.5011 413.1414 425.2522 445.1547 459.8880 502.1326 504.4761 511.2153 512.9406 528.9641 547.7938 549.5755 580.5214 604.2095 614.0955 621.4719 626.4551 643.8011 663.2538 668.0165 677.8224 691.3435 694.3979 698.1080 734.9355 745.9247 773.0498 780.3434 782.2924 790.9980 803.4024 824.3836 829.5371 836.6626 839.0425 851.9421 857.5558 866.1013 875.5347 896.3825 911.1304 932.7650 964.2345 974.2375 980.5888 981.4202 985.7144 988.4706 988.6920 990.5694 1002.6175 1003.4600 1003.8506 1008.8887 1014.3051 1021.7264 1044.4917 1081.3463 1089.8587 1093.8765 1102.5768 1116.3671 1119.8122 1165.3300 1167.8534 1173.8810 1179.2777 1181.6421 1200.5527 1211.3023 1219.2930 1228.9511 1251.9286 1257.8097 1276.1444 1294.8430 1301.3022 1313.1332 1316.7195 1351.0311 1363.6626 1371.1419 1393.1378 1399.5352 1401.9412 1418.3302 1422.5855 1441.0219 1450.2163 1458.4981 1477.3369 1480.0996 1496.2878 1520.4100 1554.6812 1563.6424 1577.2424 1593.5311 1597.0057 1601.5889 1610.5493 1613.6304 1621.3866 1626.0546 2948.4628 3119.4020 3132.3160 3137.6691 3137.7667 3145.8826 3152.0635 3152.2867 3159.5745 3162.6486 3165.6853 3166.4119 3170.0952 3174.0467 3175.6059 3179.7099 3188.3387 3198.2946
redmass: 7.9952 4.7891 5.4857 6.0224 7.2119 9.4798 5.2853 4.6663 5.1993 4.5608 6.4527 6.7503 6.1114 6.1253 6.2223 7.4838 8.2899 6.6036 4.8177 5.4026 3.6422 5.9254 6.2611 6.0063 7.3125 6.3108 5.3770 2.8483 2.9795 2.9677 7.3023 4.1567 4.4703 7.9213 4.8129 4.4755 4.0052 3.8378 5.8755 3.7779 8.1884 5.5970 6.4458 6.8499 7.1770 6.5369 6.6137 4.8095 4.6568 4.8686 7.6179 1.8359 5.0905 3.9573 1.7748 3.4854 2.4585 2.6501 6.0995 4.5679 1.6698 1.4911 1.3659 2.4173 1.2511 2.5767 3.6857 1.4867 7.4500 1.3692 1.3639 1.3688 1.3731 1.3410 1.5819 4.1401 1.3928 1.5609 3.3801 2.6971 1.4042 1.3684 2.7963 2.1382 2.8431 1.6058 3.5427 3.1695 1.9343 1.4306 1.3585 1.6962 1.1821 1.0767 1.3354 1.1106 1.6285 2.2891 5.2265 4.1272 1.9964 2.5369 3.4428 1.3048 1.3220 1.5744 2.3377 3.4536 7.9848 2.3685 10.3189 3.5544 11.3138 3.8316 4.2090 2.2270 2.6643 2.6741 2.4765 2.3709 2.9094 9.5463 7.0860 7.0109 6.6075 6.0709 8.1364 6.8066 7.6882 6.2895 8.4320 6.9426 1.0865 1.0879 1.0869 1.0885 1.0865 1.0918 1.0900 1.0876 1.0959 1.0904 1.0953 1.0954 1.1007 1.0971 1.1001 1.0895 1.0959 1.0973
irintensity: 0.5450 0.1390 0.1545 0.2767 0.4673 0.2527 0.1144 0.3972 1.9466 1.9859 4.5088 0.8393 0.9499 2.3109 4.9323 0.2597 0.4768 1.4596 16.1686 3.8791 2.8821 5.0671 1.7607 1.1015 1.8966 1.5979 2.4262 0.2539 1.5435 2.4539 5.3657 3.5544 3.9927 2.8549 3.9268 4.1330 3.6264 7.3548 5.4944 20.4441 12.2401 8.5915 0.4612 4.4329 3.3406 12.7769 20.6628 34.7305 9.8772 6.1340 14.3107 46.3124 4.2617 3.7039 42.7669 35.4079 47.5535 9.9915 20.1329 7.6075 46.5475 25.9222 13.3977 73.4688 0.2672 8.7230 25.5335 0.8319 11.0721 3.7807 3.1408 2.2659 2.5818 4.9863 26.6119 2.1441 0.5728 7.5171 5.4968 10.2024 0.9384 5.4163 28.0074 7.3855 8.0787 10.1121 10.2676 27.4807 27.2982 20.2530 16.1452 152.3729 37.1432 1.7530 96.7062 6.8534 13.3277 17.4153 395.8332 121.2297 11.8428 20.3630 94.2505 2.5549 4.2357 52.9729 75.5326 6.7090 95.1698 4.0629 110.1003 8.0142 2.9917 51.3844 10.2705 24.5873 2.7139 89.9997 70.2166 1.1834 114.3665 494.6558 57.7913 0.4787 185.0631 155.5129 21.4575 22.8517 213.0496 25.7535 118.4439 49.4753 39.8042 7.0706 0.0035 7.5628 6.1091 19.2368 8.0565 7.0164 24.5238 3.0137 5.0357 9.9553 35.4856 4.1912 30.1017 0.3944 2.2060 3.9820
temp: 298.150 k
press: 1.00000 atm
elementType: 8 8 8 7 7 7 7 6 6 6 6 6 6 6 6 6 6 6 6 6 6 6 6 6 6 6 6 6 6 6 6 6 6 6 1 1 1 1 1 1 1 1 1 1 1 1 1 1 1 1 1 1
symmnumber: 1
zpe: 1010410.9 jmol-1
zpe.correction: 0.384845 hartree
zpe.thermalcorrener: 0.411901 hartree
zpe.thermalcorrenthalpy: 0.412846 hartree
zpe.thermalcorrgfe: 0.323700 hartree
zpe.sumelectzpe: -1481.985701 hartree
zpe.sumelectthermal: -1481.958645 hartree
zpe.sumelectthermalent: -1481.957701 hartree
zpe.sumelectthermalfe: -1482.046847 hartree
dipole: -2.4070 -6.3715 1.2424
dipole: 6.9233
quadrupole: -157.4788 -227.6607 -185.4174
quadrupole: -11.2207 -4.4182 -11.3920
quadrupole: 32.7069 -37.4751 4.7682 -11.2207 -4.4182 -11.3920
hfenergy: -1482.3705462 hartree
pointgroup: C01[X(C27H18N4O3)]
dipole: -0.6036329 -2.4697154 0.977503 debye
polarizability: 679.0830223|-27.5560976|347.4625353|-17.2340012|-59.6894041|245.7762444 unknown
InChI: InChI=1S/C27H18N4O3/c32-27-24-8-4-5-9-25(24)29-26(30(27)22-14-16-23(17-15-22)31(33)34)20-10-12-21(13-11-20)28-18-19-6-2-1-3-7-19/h1-18H
charge 0 multiplicity 1
52 atoms
O  4.830453 1.347049 -0.919008
O  -0.47993 5.853041 0.292876
O  0.416928 6.155064 -1.783351
N  2.768234 0.338532 -0.344329
N  2.675223 -1.932194 0.475324
N  -3.659191 -1.286645 -0.424118
N  0.236865 5.462083 -0.708412
C  2.058238 -0.837229 0.048111
C  4.868228 -0.90303 -0.020527
C  4.217912 0.332505 -0.483174
C  2.111491 1.626932 -0.456354
C  4.074551 -1.975303 0.495735
C  0.575437 -0.886636 -0.064199
C  6.283592 -1.00738 -0.045428
C  1.336498 2.105232 0.629436
C  2.291394 2.420432 -1.615109
C  4.720246 -3.140365 0.996463
C  -0.142698 -1.673934 0.876487
C  -0.142968 -0.275133 -1.130171
C  6.908232 -2.163529 0.450551
C  6.121592 -3.228922 0.975519
C  0.714235 3.363176 0.550968
C  1.676366 3.682765 -1.70159
C  -1.538478 -1.803266 0.794429
C  -1.53469 -0.427522 -1.235036
C  0.890989 4.134321 -0.618799
C  -2.261603 -1.162832 -0.257025
C  -4.481878 -1.284301 0.597023
C  -5.927366 -1.511933 0.445431
C  -6.763124 -1.474261 1.595601
C  -6.50705 -1.770136 -0.829316
C  -8.152145 -1.691415 1.477454
C  -7.893137 -1.985701 -0.944355
C  -8.719981 -1.947393 0.207427
H  6.859758 -0.167742 -0.447193
H  1.22522 1.492206 1.528322
H  2.913892 2.054076 -2.433395
H  4.095272 -3.952619 1.379122
H  0.422208 -2.191417 1.657713
H  0.387677 0.292342 -1.900062
H  7.999761 -2.247471 0.435334
H  6.615134 -4.128087 1.360192
H  0.108696 3.757089 1.370786
H  1.793865 4.317447 -2.583291
H  -2.072732 -2.431351 1.51617
H  -2.088022 0.017789 -2.067169
H  -4.128996 -1.084003 1.63188
H  -6.320036 -1.273055 2.579356
H  -5.848796 -1.793225 -1.70371
H  -8.789875 -1.660337 2.367417
H  -8.336482 -2.182915 -1.926567
H  -9.798709 -2.115098 0.113463
