program: Gaussian 09
title: 000063161
version: EM64L-G09RevD.01
frameworkgroup: C1[X(C15H10FIN2O)]
method: RPBEPBE
basis: SDD
operation: Freq
keyword: #p
keyword: freq=noraman
keyword: PBEPBE/SDD
title: #p freq=noraman PBEPBE/SDD
converged: YES YES NO NO
title: Mulliken charges:
elementType: I F O N N C C C C C C C C C C C C C C C H H H H H H H H H H
charge: 0.114654 -0.198419 -0.228373 -0.353321 -0.038976 0.170653 0.109501 0.125126 0.050829 0.461720 -0.228098 -0.335840 -0.765320 -0.302793 -0.298213 -0.386684 -0.131747 -0.357567 -0.357766 0.327884 0.288923 0.267864 0.250025 0.249548 0.270289 0.258011 0.257632 0.255447 0.262538 0.262472
chargesum: 0.00000
title: Mulliken charges with hydrogens summed into heavy atoms:
elementType: I F O N N C C C C C C C C C C C C C C C
charge: 0.114654 -0.198419 -0.228373 -0.353321 -0.038976 0.170653 0.109501 0.125126 0.050829 0.461720 0.060825 -0.067976 0.004541 -0.044782 -0.040581 -0.386684 0.123700 -0.095030 -0.095294 0.327884
polarizability: 3.41354640e+02 1.36349717e+00 1.80425150e+02 -2.69572170e-01 8.01748906e-01 1.14033588e+02
1716.lowfreq: -0.0006 -0.0003 -0.0002 0.5222 4.5587 4.9893 18.7833 32.0125 42.9664
frequency: 17.0600 31.7722 42.9517 60.2534 109.4915 132.8255 146.8953 155.7166 185.9752 189.0503 191.0588 229.9836 308.6478 348.1339 350.6394 352.3620 377.4128 417.4574 418.0579 461.0810 483.1333 498.5556 513.5056 542.6280 549.7393 602.4073 619.4325 638.6220 648.9178 658.1366 696.5038 718.2349 788.3824 788.8476 816.1087 825.3593 842.2240 843.3263 867.1775 934.4260 944.9010 960.5311 977.7353 989.4779 1003.2443 1017.8187 1047.5388 1051.0910 1082.7141 1099.8770 1120.1349 1154.4759 1190.6696 1199.7159 1230.0740 1244.2612 1275.2359 1284.8510 1310.1303 1375.4087 1380.9487 1396.1645 1404.9207 1407.1335 1446.7044 1451.4771 1464.7887 1491.1236 1543.7931 1561.7358 1598.6749 1605.3057 1612.5647 1620.4695 2998.6197 3076.7511 3136.6642 3155.6587 3156.8793 3157.3613 3169.7756 3177.3864 3181.0632 3183.7860
redmass: 3.8873 9.5397 12.5310 4.8197 10.7563 4.9358 4.4900 1.7079 12.3230 5.7083 2.2915 5.9609 5.0475 5.2720 4.3665 9.3329 6.7803 3.0306 4.1555 3.8585 6.2182 6.6407 3.4870 4.2335 7.6681 4.3097 5.1015 5.7059 7.5250 6.5461 6.1619 4.1694 4.0903 5.9996 1.2441 1.8589 5.2710 1.5899 4.3261 1.4315 1.3889 1.3569 1.3564 3.5260 3.0304 2.6851 1.5415 2.3024 3.0646 1.2745 1.7498 1.3228 2.1533 3.2839 2.0302 4.7862 1.9236 1.2591 5.7278 7.8866 10.0722 1.6871 3.6311 2.3388 2.0500 1.3005 1.0464 2.7891 8.2432 7.0504 7.7077 8.1433 6.7534 10.9785 1.0385 1.0968 1.0988 1.0905 1.0886 1.0900 1.0928 1.0978 1.0965 1.0975
irintensity: 0.0318 0.8931 0.0310 0.6513 0.3024 1.2330 0.9378 2.1887 1.3896 2.0789 0.9959 0.2873 1.5536 6.8776 4.5086 0.5403 4.5281 0.0011 0.0815 3.6311 7.4921 3.8103 18.4570 14.6801 9.0433 35.1590 1.2911 0.5235 30.8074 1.3212 1.3371 6.5470 1.6220 6.5710 0.0074 39.0405 23.8188 48.7305 30.5783 7.8375 1.4087 0.0545 1.4938 1.1324 26.5601 1.9209 3.3629 7.7929 11.9063 13.9452 22.5645 61.9376 35.7509 61.9979 24.1357 45.9089 34.2150 0.9202 114.2957 1.4371 48.8297 27.7857 1.5233 6.8821 73.5843 104.8342 23.1303 196.2384 2.6156 222.5325 48.9154 2.7207 76.7824 253.0871 15.1889 8.0402 8.4829 2.6390 1.0547 6.0362 1.5961 7.1739 1.1455 0.9633
temp: 298.150 k
press: 1.00000 atm
elementType: 53 9 8 7 7 6 6 6 6 6 6 6 6 6 6 6 6 6 6 6 1 1 1 1 1 1 1 1 1 1
symmnumber: 1
zpe: 558309.9 jmol-1
zpe.correction: 0.212649 hartree
zpe.thermalcorrener: 0.229630 hartree
zpe.thermalcorrenthalpy: 0.230574 hartree
zpe.thermalcorrgfe: 0.164692 hartree
zpe.sumelectzpe: -872.318479 hartree
zpe.sumelectthermal: -872.301499 hartree
zpe.sumelectthermalent: -872.300554 hartree
zpe.sumelectthermalfe: -872.366436 hartree
dipole: -1.5357 3.0851 -0.0139
dipole: 3.4463
quadrupole: -127.1753 -133.9479 -122.1247
quadrupole: -6.4832 -0.0249 0.3260
quadrupole: 0.5739 -6.1986 5.6246 -6.4832 -0.0249 0.3260
hfenergy: -872.5311284 hartree
pointgroup: C01 [X(C15H10F1I1N2O1)]
dipole: 0.3480675 1.3104212 -0.0001434 debye
polarizability: 335.3974878|30.4162104|186.3715836|0.3898542|-1.1161711|114.0443061 unknown
InChI: InChI=1S/C15H10FIN2O/c1-9-18-14-7-4-11(17)8-13(14)15(20)19(9)12-5-2-10(16)3-6-12/h2-8H,1H3
charge 0 multiplicity 1
30 atoms
I  -5.804883 -2.363917 -0.006081
F  5.935926 -0.944798 0.013717
O  -0.060892 -1.898577 0.020682
N  0.455206 0.398021 0.010428
N  -1.243242 2.10831 0.003194
C  -1.889114 -0.290735 0.00623
C  0.032686 1.75067 0.007494
C  -0.473432 -0.705501 0.013479
C  -2.222899 1.099675 0.000724
C  1.871998 0.057862 0.011652
C  -2.905421 -1.281601 0.004629
C  -3.594452 1.476603 -0.006783
C  1.093517 2.82386 0.014326
C  2.556573 -0.084149 -1.215606
C  2.538195 -0.152994 1.239094
C  -4.248182 -0.879327 -0.003003
C  -4.602414 0.498986 -0.00878
C  3.926989 -0.419912 -1.223168
C  3.908362 -0.489613 1.248019
C  4.56943 -0.610924 0.01292
H  -2.604372 -2.333039 0.009237
H  -3.840299 2.542393 -0.010845
H  1.746209 2.760793 -0.874619
H  1.748826 2.745125 0.900269
H  0.586771 3.798979 0.023091
H  2.017287 0.052815 -2.158128
H  1.985075 -0.068197 2.17961
H  -5.654555 0.797634 -0.014698
H  4.484256 -0.540315 -2.156105
H  4.451652 -0.662728 2.180922
