program: Gaussian 09
title: 000063159
version: EM64L-G09RevD.01
frameworkgroup: C1[X(C18H19N3O2)]
method: RPBEPBE
basis: SDD
operation: Freq
keyword: #p
keyword: freq=noraman
keyword: PBEPBE/SDD
title: #p freq=noraman PBEPBE/SDD
converged: YES YES NO NO
title: Mulliken charges:
elementType: O O N N N C C C C C C C C C C C C C C C C C C H H H H H H H H H H H H H H H H H H H
charge: -0.275248 -0.248071 -0.348780 -0.012755 -0.699782 0.086721 0.309117 0.228728 0.102254 0.006879 0.350542 -0.383583 -0.552147 -0.303188 -0.338003 0.534214 -0.403623 -0.409704 -0.831310 -0.255225 -0.236348 -0.187675 -0.684287 0.236782 0.210754 0.266515 0.271091 0.256150 0.232268 0.222370 0.222460 0.277957 0.227659 0.230334 0.225788 0.193775 0.191603 0.315251 0.308983 0.203851 0.231990 0.225691
chargesum: 0.00000
title: Mulliken charges with hydrogens summed into heavy atoms:
elementType: O O N N N C C C C C C C C C C C C C C C C C C
charge: -0.275248 -0.248071 -0.348780 -0.012755 -0.075548 0.086721 0.309117 0.228728 0.102254 0.006879 0.350542 0.063954 -0.285631 -0.032096 -0.081854 0.534214 -0.171355 -0.187333 -0.103234 -0.024891 -0.010560 0.197703 -0.022754
polarizability: 3.52618353e+02 1.43938431e+01 2.14358118e+02 1.91212974e+00 8.87618247e+00 1.51965345e+02
1716.lowfreq: -6.7270 -0.0007 0.0003 0.0003 1.0468 8.7121 27.1546 36.9761 41.9460
frequency: 27.0787 36.8618 41.9350 49.2513 65.1085 71.3090 99.3483 137.3828 141.4416 147.5084 162.4521 178.4903 210.3377 213.7254 230.3883 236.1733 252.2524 303.6998 321.7662 334.2989 365.9534 376.8021 381.0685 405.6814 423.2206 434.5918 456.3962 466.3283 482.0652 514.7246 533.0509 544.4146 565.0834 586.3308 610.6028 640.8950 680.3957 700.7320 710.1425 719.4447 749.0419 776.5039 790.0023 798.9906 817.8190 836.0537 844.2249 852.9824 866.1440 904.2889 924.9540 943.3364 965.0656 966.5747 984.9003 986.6440 997.1937 1007.7219 1034.9094 1044.8965 1046.9195 1055.9168 1078.5541 1114.5539 1118.1821 1130.8936 1135.9618 1173.7408 1182.3600 1193.4007 1211.6902 1230.6334 1252.6101 1255.6156 1282.4700 1289.2506 1305.5785 1336.9437 1339.5275 1374.6254 1388.9003 1396.4942 1403.5948 1405.3116 1433.9696 1454.2652 1458.8443 1462.8242 1463.9519 1478.1367 1479.4113 1486.3223 1489.7365 1494.1522 1550.7864 1560.6879 1590.0721 1605.6187 1613.6309 1636.3964 1647.6687 2920.8503 2947.4644 2969.6224 2978.5187 2993.3648 3025.9586 3058.6828 3088.5727 3090.6596 3100.4229 3121.7347 3123.6659 3136.8082 3141.1001 3156.2702 3165.6013 3179.6283 3565.2059 3705.7201
redmass: 3.8911 5.3412 4.4441 3.5723 2.0013 3.6411 4.7677 4.4099 1.3930 2.5877 5.3023 2.9311 4.5554 3.5406 5.1123 1.2036 4.7834 3.2163 3.7708 3.8002 3.8133 1.1499 3.4734 1.2317 3.2143 4.0925 3.0002 4.4904 4.8683 4.0500 5.1127 7.7337 5.4159 3.8273 5.3967 5.2850 6.4153 7.0265 5.0585 3.1406 1.8443 2.4378 3.7245 4.7612 1.0936 1.6725 3.9765 3.5945 1.3654 1.6370 3.1188 1.4330 1.7380 2.5994 1.3281 1.6061 2.1724 4.2466 1.6534 1.8516 1.6797 4.2155 2.9822 1.8658 2.0589 1.4270 1.4435 1.0581 2.4972 1.4486 2.4045 1.7526 1.2766 2.3883 1.8283 1.6492 2.8618 2.5709 1.5431 8.1250 1.2519 1.2417 6.1995 1.4836 2.1465 1.2545 1.0436 2.7893 1.0879 1.0752 1.4974 1.6583 1.0823 4.0033 9.6511 7.1308 6.5961 11.3953 6.5767 2.2613 1.7731 1.0551 1.0607 1.1067 1.0369 1.0358 1.1001 1.0974 1.0993 1.0991 1.1009 1.0864 1.0893 1.0905 1.0918 1.0970 1.0955 1.0967 1.0450 1.1041
irintensity: 0.4014 2.1284 1.6555 0.7991 1.3881 3.9407 2.5700 3.8388 0.7430 5.2159 0.2299 2.1653 0.3451 1.5600 6.7683 1.0546 0.1738 4.1450 0.3115 0.8002 21.6481 114.0282 1.1153 179.7058 0.3597 8.1948 7.4848 2.4234 3.0218 4.6822 4.2223 0.5081 3.6810 5.2340 6.9724 14.3203 0.9125 3.1413 1.3724 7.4303 69.3688 6.4188 3.7942 5.9960 3.7138 54.3262 4.6069 12.4765 0.3154 20.8233 4.5434 0.9689 7.6934 23.1371 0.0078 1.3240 12.9146 12.7192 3.4148 6.9653 10.5899 167.7228 5.1708 32.4802 16.5677 20.7695 6.2266 1.0072 1.6112 12.1890 6.1253 8.8958 3.7628 12.3402 2.4675 4.7147 67.4232 195.8120 6.1766 4.5182 21.3910 19.2017 41.8329 16.6342 3.2414 4.5323 10.3300 6.6519 30.4568 1.5680 19.8955 84.6601 4.7718 122.7804 21.6012 58.3840 2.5075 277.9978 3.3667 16.4694 404.9319 66.0997 58.0131 53.1941 19.8025 25.4418 28.0288 10.4613 26.0064 40.0138 34.0082 4.3878 21.9602 17.2899 11.3566 38.1457 11.7227 4.7794 125.2932 23.0355
temp: 298.150 k
press: 1.00000 atm
elementType: 8 8 7 7 7 6 6 6 6 6 6 6 6 6 6 6 6 6 6 6 6 6 6 1 1 1 1 1 1 1 1 1 1 1 1 1 1 1 1 1 1 1
symmnumber: 1
zpe: 879440.9 jmol-1
zpe.correction: 0.334961 hartree
zpe.thermalcorrener: 0.356420 hartree
zpe.thermalcorrenthalpy: 0.357364 hartree
zpe.thermalcorrgfe: 0.283859 hartree
zpe.sumelectzpe: -1010.387314 hartree
zpe.sumelectthermal: -1010.365855 hartree
zpe.sumelectthermalent: -1010.364911 hartree
zpe.sumelectthermalfe: -1010.438416 hartree
dipole: 1.1024 0.4902 1.3396
dipole: 1.8028
quadrupole: -84.9238 -136.3056 -133.9107
quadrupole: -2.3203 -5.5714 -2.5280
quadrupole: 33.4563 -17.9255 -15.5307 -2.3203 -5.5714 -2.5280
hfenergy: -1010.7222749 hartree
pointgroup: C01 [X(C18H19N3O2)]
dipole: -0.4423322 -0.1797329 0.5244973 debye
polarizability: 353.9597258|0.5838053|213.6812171|-5.9852817|-5.0194629|151.300874 unknown
InChI: InChI=1S/C18H19N3O2/c1-3-23-11-17-20-15-9-8-13(19)10-14(15)18(22)21(17)16-7-5-4-6-12(16)2/h4-10H,3,11,19H2,1-2H3
charge 0 multiplicity 1
42 atoms
O  1.895827 -2.484051 -0.240982
O  -0.704835 2.18489 -0.694068
N  0.248309 0.186766 0.107876
N  -1.0991 -1.69986 0.787259
N  -5.797948 1.112208 -0.638172
C  0.08168 -1.126697 0.61682
C  1.578971 0.77174 -0.045101
C  -2.184462 0.349306 -0.099425
C  -0.871314 1.003731 -0.266639
C  -2.248395 -0.979222 0.430408
C  2.032608 1.738783 0.893563
C  1.313862 -1.91528 0.989135
C  -3.358664 1.049146 -0.453248
C  2.373172 0.375538 -1.141734
C  -3.528017 -1.580951 0.593029
C  -4.627708 0.440835 -0.291679
C  3.327625 2.281419 0.699351
C  -4.692117 -0.89111 0.241174
C  1.158539 2.19901 2.042449
C  3.65779 0.933845 -1.316516
C  4.136368 1.888258 -0.390599
C  3.187797 -3.140589 0.024935
C  3.681545 -3.728199 -1.296218
H  0.99519 -2.727917 1.669626
H  2.064213 -1.272399 1.498226
H  -3.255007 2.064319 -0.852666
H  1.981393 -0.369933 -1.83822
H  -3.570394 -2.597175 0.996782
H  3.698308 3.029043 1.410633
H  -5.67077 -1.369687 0.370226
H  1.7369 2.797401 2.766322
H  0.331028 2.824507 1.658941
H  0.700489 1.349949 2.582794
H  4.27376 0.63049 -2.169898
H  5.131444 2.329125 -0.518709
H  3.907612 -2.392543 0.426286
H  3.052176 -3.937244 0.790178
H  -5.762763 2.052708 -1.020471
H  -6.706285 0.672187 -0.525102
H  4.650819 -4.239817 -1.152648
H  2.95315 -4.457544 -1.690213
H  3.814405 -2.930585 -2.047704
