program: Gaussian 09
title: 000063151
version: EM64L-G09RevD.01
frameworkgroup: C1[X(C18H16N4OS)]
method: RPBEPBE
basis: SDD
operation: Freq
keyword: #p
keyword: freq=noraman
keyword: PBEPBE/SDD
title: #p freq=noraman PBEPBE/SDD
converged: YES YES NO NO
title: Mulliken charges:
elementType: S O N N N N C C C C C C C C C C C C C C C C C C H H H H H H H H H H H H H H H H
charge: 0.279709 -0.222345 -0.291290 -0.446228 -0.119154 -0.056417 -0.368832 0.311067 -0.478804 -0.747794 -0.285889 0.145779 0.122527 0.115758 0.413841 -0.319686 -0.366203 -0.309442 -0.310802 -0.245363 -0.200357 -0.213453 -0.208511 -0.229014 0.218757 0.220994 0.225875 0.228153 0.291046 0.290122 0.358551 0.272863 0.254978 0.247236 0.251876 0.236831 0.235205 0.232232 0.232845 0.233340
chargesum: 0.00000
title: Mulliken charges with hydrogens summed into heavy atoms:
elementType: S O N N N N C C C C C C C C C C C C C C C C C C
charge: 0.279709 -0.222345 -0.291290 -0.087677 -0.119154 -0.056417 0.070918 0.311067 -0.024776 -0.166627 -0.285889 0.145779 0.122527 0.115758 0.413841 -0.046823 -0.111225 -0.062206 -0.058926 -0.008533 0.034849 0.018779 0.024334 0.004326
polarizability: 2.92328559e+02 1.71793493e+01 3.13459642e+02 -1.81421207e+00 3.22758098e+00 1.53879831e+02
1716.lowfreq: -5.3853 -1.9676 -0.0016 -0.0010 0.0005 8.4345 15.4762 26.0008 36.8260
frequency: 15.0043 25.8761 36.7114 44.6918 53.7512 67.9329 86.5072 100.5000 120.5374 128.7345 142.7088 166.1192 200.5733 242.5175 262.8253 285.2608 292.7706 318.2405 351.4240 359.6592 404.1809 406.4566 457.8027 488.6874 515.8736 531.5732 540.5835 552.1958 586.0656 611.5754 626.2840 637.5824 654.9130 685.2393 686.0483 687.7965 695.0011 701.5376 729.8768 756.5054 779.1770 790.5074 800.9352 822.5082 843.5066 853.4175 868.7418 889.7630 893.2545 915.8675 928.5709 944.0893 974.8255 978.7166 989.8363 990.8823 998.2151 1002.3264 1012.6456 1025.1216 1046.4290 1052.1548 1076.1456 1079.7242 1102.1762 1160.0308 1161.2823 1165.7517 1174.4277 1178.7922 1186.7538 1210.2659 1211.7026 1233.8546 1247.7024 1270.8662 1278.3154 1278.6120 1294.5411 1309.9348 1311.3780 1383.9214 1390.1459 1409.7881 1439.3258 1446.5804 1458.4108 1460.5887 1466.0574 1479.3911 1506.7534 1511.5848 1566.2244 1589.9276 1600.0002 1607.9894 1613.9152 1625.5956 2962.4620 2997.4524 3025.9247 3056.0797 3059.3608 3134.3634 3136.5533 3144.0206 3144.9691 3150.0238 3154.5043 3161.7556 3164.1788 3173.2835 3174.5974 3444.5397
redmass: 3.8371 6.1419 5.0704 5.2107 4.8366 4.6206 4.3396 3.2500 4.5044 4.6511 5.9441 5.5783 5.6371 5.7212 5.5110 6.0736 4.1359 4.3656 8.5640 3.4827 4.6968 2.8019 4.3005 4.0657 7.6436 3.9375 6.6513 8.2150 8.3040 6.2715 3.3898 7.0845 1.8670 6.1275 3.5232 3.7462 1.9731 3.5342 4.1964 2.0162 1.7376 2.6682 4.8862 1.4279 1.2498 2.4642 3.5348 4.4152 1.4889 3.0068 2.1495 3.9629 1.3915 1.3717 5.2629 3.2818 1.3312 1.3329 3.7267 2.0783 3.6481 2.6712 1.6637 1.5302 2.0172 1.4979 1.1397 1.1374 1.0551 1.1994 2.0670 1.1066 2.3214 3.7013 1.2142 1.4349 2.0940 1.5418 2.5056 1.5895 1.3503 9.9257 10.4852 1.1291 2.2206 2.6049 2.3411 2.2523 1.1751 2.3968 1.2903 7.5601 7.0705 6.2488 6.6184 6.3146 7.4678 10.0212 1.0632 1.0668 1.0961 1.0583 1.1047 1.0852 1.0861 1.0887 1.1066 1.0895 1.0931 1.0955 1.0974 1.1007 1.1017 1.0833
irintensity: 0.1725 0.1275 2.5332 0.2377 1.4156 0.5249 4.5727 1.2438 3.4255 2.7253 3.0734 1.8577 0.3382 0.8111 1.0518 2.4598 18.1187 2.1058 4.1404 20.5664 0.6280 0.0310 2.5895 12.7631 1.6105 3.6058 16.3858 2.6897 3.9583 0.7448 23.5905 9.4116 54.0786 1.8749 23.1267 22.8011 43.5840 7.9397 1.5900 48.5006 71.9578 8.8260 1.4345 7.7464 0.2126 6.5939 0.7179 0.7886 0.3004 9.6937 16.0362 18.2897 0.1547 2.4468 10.5672 5.6907 0.3762 0.0314 16.4552 17.1574 5.4504 12.6080 0.4770 10.5965 18.1271 48.7366 7.1597 12.0547 0.4534 32.2537 119.2823 0.2514 19.7082 45.1678 15.3923 44.2504 49.3583 44.5648 31.7710 7.3747 0.9580 2.5936 45.6183 20.6575 7.3744 6.5052 43.5593 134.3902 11.1479 48.2402 9.2717 452.8680 0.5823 160.6621 5.0653 0.8512 158.2457 197.7465 65.0264 65.3188 46.9663 6.0480 45.3959 0.1215 3.4868 4.1602 0.1279 6.4438 24.8344 9.5964 16.9446 26.7210 11.1426 336.6281
temp: 298.150 k
press: 1.00000 atm
elementType: 16 8 7 7 7 7 6 6 6 6 6 6 6 6 6 6 6 6 6 6 6 6 6 6 1 1 1 1 1 1 1 1 1 1 1 1 1 1 1 1
symmnumber: 1
zpe: 802886.5 jmol-1
zpe.correction: 0.305803 hartree
zpe.thermalcorrener: 0.326357 hartree
zpe.thermalcorrenthalpy: 0.327302 hartree
zpe.thermalcorrgfe: 0.253336 hartree
zpe.sumelectzpe: -1386.135503 hartree
zpe.sumelectthermal: -1386.114949 hartree
zpe.sumelectthermalent: -1386.114005 hartree
zpe.sumelectthermalfe: -1386.187971 hartree
dipole: 0.2161 2.0141 0.3898
dipole: 2.0628
quadrupole: -147.2450 -138.0972 -140.1352
quadrupole: 24.1774 9.0115 -4.3450
quadrupole: -5.4192 3.7286 1.6906 24.1774 9.0115 -4.3450
hfenergy: -1386.4413063 hartree
pointgroup: C01 [X(C18H16N4O1S1)]
dipole: 0.5697931 -0.5268509 0.2375504 debye
polarizability: 287.6798954|-14.1135189|315.5099012|17.1751814|-10.7144475|156.478236 unknown
InChI: InChI=1S/C18H16N4OS/c23-17-14-8-4-5-9-15(14)21-18(24-12-16-19-10-11-20-16)22(17)13-6-2-1-3-7-13/h1-9,19H,10-12H2
charge 0 multiplicity 1
40 atoms
S  -1.921779 0.815718 -0.984788
O  2.834284 1.620665 0.621633
N  0.655118 1.109734 -0.104475
N  -2.681361 -2.431492 0.076571
N  -4.736784 -1.704545 -0.686614
N  -0.06778 -1.156687 -0.475988
C  -3.598783 -3.109484 1.016426
C  -3.41978 -1.622862 -0.780156
C  -4.99913 -2.726648 0.391658
C  -2.721288 -0.738288 -1.767813
C  -0.296791 0.145736 -0.47352
C  2.256831 -0.71507 0.257844
C  1.998923 0.736518 0.291609
C  1.215863 -1.617168 -0.128769
C  0.322798 2.531657 -0.095381
C  3.537281 -1.213354 0.61262
C  1.480397 -3.014375 -0.15701
C  0.745329 3.350714 -1.164192
C  -0.394563 3.067535 0.996032
C  3.786334 -2.595343 0.584048
C  2.752789 -3.494296 0.196185
C  0.430958 4.726298 -1.144954
C  -0.708563 4.444378 1.006426
C  -0.298006 5.273422 -0.06282
H  -3.483662 -2.72138 2.048838
H  -3.432159 -4.201965 1.037047
H  -5.495425 -3.604625 -0.062907
H  -5.690407 -2.30226 1.140674
H  -3.450005 -0.321412 -2.477725
H  -1.908255 -1.264387 -2.291873
H  -1.664092 -2.319485 0.158036
H  4.309272 -0.493793 0.904263
H  0.678971 -3.693145 -0.465453
H  1.314427 2.914967 -1.991392
H  -0.697374 2.415882 1.822049
H  4.772978 -2.982782 0.857714
H  2.951524 -4.571388 0.171154
H  0.755492 5.369056 -1.970002
H  -1.26774 4.867194 1.847644
H  -0.540741 6.341561 -0.051139
