program: Gaussian 09
title: 000063145
version: EM64L-G09RevD.01
frameworkgroup: C1[X(C10H10N2O2)]
method: RPBEPBE
basis: SDD
operation: Freq
keyword: #p
keyword: freq=noraman
keyword: PBEPBE/SDD
title: #p freq=noraman PBEPBE/SDD
converged: YES YES NO NO
title: Mulliken charges:
elementType: O O N N C C C C C C C C C C H H H H H H H H H H
charge: -0.447827 -0.213363 -0.413843 -0.110975 0.097814 0.404212 -0.113168 0.058879 -0.027807 -0.406653 -0.667953 -0.315160 -0.192037 -0.248143 0.218652 0.317870 0.234942 0.261058 0.242204 0.176936 0.279336 0.236927 0.239490 0.388611
chargesum: 0.00000
title: Mulliken charges with hydrogens summed into heavy atoms:
elementType: O O N N C C C C C C C C C C
charge: -0.059216 -0.213363 -0.095974 -0.110975 0.097814 0.404212 0.105484 0.058879 -0.027807 -0.171710 0.012244 -0.035823 0.044890 -0.008654
polarizability: 1.77938985e+02 -1.63490325e+00 1.45125955e+02 3.38431003e+00 5.15053606e+00 6.11845021e+01
1716.lowfreq: -5.0559 -0.0010 -0.0009 0.0006 5.0650 8.1851 40.6432 64.1712 128.5780
frequency: 40.5902 64.1628 128.5774 160.2720 181.1598 221.9993 240.5755 277.8054 296.0111 359.3013 420.1384 435.1906 464.6884 517.6592 529.1716 555.1220 585.3899 595.6582 629.6098 647.7834 684.7474 708.4572 753.8311 773.6994 798.1848 844.3121 879.4745 883.3134 953.7473 971.0204 995.8107 1004.4869 1032.2921 1074.7294 1078.4825 1107.8414 1118.6572 1171.1836 1190.7536 1236.4092 1251.2698 1271.6926 1282.3151 1310.3167 1386.0752 1390.8427 1406.8050 1427.7163 1458.2056 1465.9939 1476.5170 1501.7024 1560.6041 1594.1685 1608.6465 1626.2320 2932.3236 2982.6054 3082.4084 3113.2387 3127.0264 3145.3978 3157.9918 3173.5979 3241.1825 3535.2125
redmass: 4.0977 4.3887 5.4091 4.5969 4.5129 1.6320 1.9466 6.4998 4.4420 5.1646 3.3915 3.5229 5.1950 4.8348 4.5230 4.5243 2.3596 1.9919 1.2247 4.2943 3.6956 3.8831 4.9407 1.5835 3.2526 5.1823 1.5289 2.6486 3.4083 1.3701 3.2647 1.3391 2.0733 2.4105 3.5492 2.2204 2.1953 1.1012 1.9212 1.5009 2.2715 1.9518 1.7643 1.2584 1.3355 1.9000 2.7213 1.8946 1.1813 2.7493 1.0724 2.8290 4.6948 9.2518 6.6898 6.9820 1.0824 1.0383 1.0956 1.1013 1.0884 1.0891 1.0939 1.1003 1.0640 1.0777
irintensity: 0.6773 0.0334 0.7243 4.4412 0.1621 0.2085 2.5723 14.2920 2.4698 1.9629 12.5840 2.0328 1.8760 2.7666 4.4216 19.6788 43.5438 57.8412 46.5781 8.9728 22.0990 15.2547 2.4095 107.6753 1.6323 1.3773 0.3534 2.6339 11.7861 2.8189 53.1444 0.4844 1.4250 19.6489 75.7012 13.2563 44.1451 2.4659 4.1437 1.7790 66.1148 63.4840 1.3770 9.6452 32.2414 203.9285 74.3387 6.2199 18.1250 63.9664 10.8380 66.2968 320.1992 9.4970 212.6849 78.2837 42.5205 26.9402 31.3353 18.4326 5.3429 8.7896 4.9339 20.5424 160.0463 36.3715
temp: 298.150 k
press: 1.00000 atm
elementType: 8 8 7 7 6 6 6 6 6 6 6 6 6 6 1 1 1 1 1 1 1 1 1 1
symmnumber: 1
zpe: 485219.6 jmol-1
zpe.correction: 0.184810 hartree
zpe.thermalcorrener: 0.196609 hartree
zpe.thermalcorrenthalpy: 0.197553 hartree
zpe.thermalcorrgfe: 0.146550 hartree
zpe.sumelectzpe: -646.026887 hartree
zpe.sumelectthermal: -646.015088 hartree
zpe.sumelectthermalent: -646.014144 hartree
zpe.sumelectthermalfe: -646.065148 hartree
dipole: 3.3144 -7.7466 -0.1645
dipole: 8.4274
quadrupole: -81.8631 -84.2311 -83.7490
quadrupole: 4.9312 -1.2744 1.1139
quadrupole: 1.4180 -0.9501 -0.4679 4.9312 -1.2744 1.1139
hfenergy: -646.2116976 hartree
pointgroup: C01 [X(C10H10N2O2)]
dipole: -1.339681 -2.7593416 -1.2587983 debye
dipolederiv: -0.6671761 -0.1314727 -0.0666482 -0.0096657 -0.5665974 -0.0957299 -0.0182954 -0.0900753 -0.611405 -0.5027405 0.1362803 0.0467292 0.0216127 -1.0911 -0.278923 -0.0048594 -0.2565732 -0.4551216 -1.2254979 -0.1468813 -0.1046022 -0.1338727 -0.52505 -0.121471 -0.1189483 -0.1239001 -0.2605263 -0.941707 0.5678329 0.1909228 0.2393157 -0.911844 -0.2584943 0.02041 -0.1947837 -0.3378527 0.8656006 0.0607216 0.0288404 0.0725183 0.9830053 0.3660517 0.1318142 0.3375397 0.1771869 0.8896907 -0.1423415 -0.0024497 -0.1095807 0.0855374 -0.0034403 0.0212422 -0.0108626 0.0730627 0.1576965 0.1262232 0.0419531 0.2649231 0.4455443 0.0501663 0.1025838 0.0401959 0.4373285 -0.3886183 -0.2569349 -0.1176127 -0.0471448 -0.317712 -0.1232275 -0.04449 -0.1351462 -0.0517232 1.1130254 -0.3042198 -0.0629211 -0.07461 1.3938755 0.4302088 0.0363368 0.3991044 0.3892252 -0.3377021 0.0626595 0.0160985 -0.1063358 0.069433 0.0866537 -0.0487978 0.1028962 -0.1574627 -0.0800587 0.0580276 0.0744628 0.0211743 0.0661067 -0.0137139 -0.0725425 -0.0262106 -0.1076659 0.0462245 0.1460258 0.0633811 -0.1262003 0.0823589 0.0564035 -0.0340723 0.0757651 -0.0657168 0.1119386 -0.0529029 0.0000276 0.0640831 0.1681888 0.1105555 0.042305 0.1018791 -0.0795999 0.0474955 -0.1409892 -0.0321455 -0.0898653 -0.2369486 -0.0308167 -0.0165109 -0.0356985 -0.1845795 -0.022484 -0.0247911 0.0045956 -0.0205288 -0.1451482 0.0812336 0.0225076 0.0947192 -0.0410329 0.2024973 -0.0158616 -0.0315481 0.0153096 0.176453 -0.0551234 -0.0339729 -0.0590713 0.2868882 0.0573664 0.0880501 0.0227107 0.0425974 -0.0480691 -0.0768813 0.0055212 -0.0749653 0.1446584 -0.1304829 0.0663681 0.0241296 0.0567116 0.0966968 -0.0078742 0.0267479 -0.0127134 0.0848769 0.1164158 0.0409959 -0.0315324 0.017153 -0.0311897 0.1137139 -0.009587 0.060602 -0.0060346 0.0344573 -0.1409466 -0.0486651 -0.1156577 -0.0933842 -0.0908915 -0.0200927 -0.0554496 0.0272496 0.1160724 -0.0088687 -0.0064366 0.0591625 0.031456 -0.0405577 0.0189229 -0.0452451 0.1376215 -0.0126788 -0.0900334 -0.045451 -0.0950362 0.0233993 -0.0559756 -0.0485531 -0.0561162 0.1318186 -0.1003335 0.0448839 -0.0038431 0.0475806 0.0853173 -0.0259972 -0.0038464 -0.0262527 0.1565104 0.6509988 0.0581746 0.0400043 0.0063561 0.259671 -0.0158697 0.0461772 -0.0096377 0.312294 unknown
polarizability: 177.8524886|-0.9405313|133.7026935|5.0903851|29.1779958|72.6942602 unknown
InChI: InChI=1S/C10H10N2O2/c1-6(13)9-11-8-5-3-2-4-7(8)10(14)12-9/h2-6,11,13H,1H3
charge 0 multiplicity 1
24 atoms
O  3.802524 0.416369 0.743316
O  -0.31255 2.663914 1.154829
N  0.548548 -1.12023 -0.159186
N  1.270812 0.999698 0.677716
C  1.519275 -0.227586 0.248022
C  -0.814927 -0.762334 -0.137399
C  2.992584 -0.657827 0.209709
C  -1.145443 0.548321 0.318041
C  -0.068684 1.49465 0.749011
C  -1.825331 -1.666586 -0.549587
C  3.461135 -1.011024 -1.221757
C  -2.508199 0.936533 0.353349
C  -3.170285 -1.256663 -0.505641
C  -3.516645 0.04545 -0.054059
H  3.105533 -1.551431 0.863931
H  0.819936 -2.049528 -0.486956
H  -1.561026 -2.67203 -0.897968
H  4.54438 -1.212369 -1.189233
H  3.288219 -0.16042 -1.902704
H  2.955053 -1.909509 -1.626063
H  -2.736565 1.947467 0.706605
H  -3.955848 -1.950634 -0.823221
H  -4.567352 0.350683 -0.025222
H  3.152357 1.161186 0.953468
