program: Gaussian 09
title: 000063139
version: EM64L-G09RevD.01
frameworkgroup: C1[X(C12H13N3O2)]
method: RPBEPBE
basis: SDD
operation: Freq
keyword: #p
keyword: freq=noraman
keyword: PBEPBE/SDD
title: #p freq=noraman PBEPBE/SDD
converged: NO YES NO NO
title: Mulliken charges:
elementType: O O N N N C C C C C C C C C C C C H H H H H H H H H H H H H
charge: -0.240506 -0.244979 -0.176962 -0.483123 -0.081677 -0.369275 -0.357572 -0.287115 -0.307130 0.239339 0.397544 0.067784 -0.046213 -0.406899 -0.323303 -0.198268 -0.254197 0.185181 0.242307 0.222557 0.299337 0.225304 0.195134 0.206775 0.227997 0.301035 0.225432 0.277296 0.230529 0.233669
chargesum: 0.00000
title: Mulliken charges with hydrogens summed into heavy atoms:
elementType: O O N N N C C C C C C C C C C C C
charge: -0.240506 -0.244979 -0.176962 -0.182087 -0.081677 0.058212 0.164322 0.133322 0.127641 0.239339 0.397544 0.067784 -0.046213 -0.181467 -0.046007 0.032261 -0.020529
polarizability: 2.39085419e+02 1.83355217e-01 1.68805980e+02 9.50468428e+00 2.98044375e+00 8.06202209e+01
1716.lowfreq: -14.7852 -0.0007 -0.0006 -0.0003 3.0623 6.9168 24.4020 45.9713 70.7708
frequency: 20.2147 45.6594 70.7232 123.6973 147.4233 170.8604 214.0787 243.8184 256.8247 288.7948 303.3963 374.8595 395.0322 425.8864 455.6940 467.1358 488.1283 510.2902 541.0013 546.3129 583.4996 618.7986 638.5242 675.0060 683.8316 738.1726 765.5226 784.2843 795.3763 825.9891 836.3455 870.0293 892.4973 913.2215 963.1800 963.5553 999.1036 1009.7109 1021.9954 1037.1514 1050.1271 1072.3942 1096.1186 1103.1624 1129.6115 1167.7582 1186.5768 1194.8755 1214.8899 1244.6747 1267.5166 1277.7544 1279.0717 1283.9973 1330.5626 1341.9360 1358.9381 1370.6604 1378.5486 1406.0091 1429.4802 1445.3276 1448.2990 1451.6242 1455.9989 1464.4203 1488.6242 1555.3215 1592.3297 1610.2999 1625.2384 2947.3955 2965.7084 2968.6586 2980.4874 3059.0416 3080.4032 3083.0017 3097.8661 3119.3099 3140.7320 3154.4703 3170.3774 3554.8567
redmass: 4.5501 3.8340 4.2672 4.8219 6.5461 5.9261 2.1811 3.3005 4.8694 5.0087 4.3952 2.9887 2.3874 3.3687 2.8167 6.9463 6.5205 1.7740 5.3339 2.0143 2.8852 5.1817 3.6760 3.9889 9.9268 6.3594 1.7097 2.8357 4.6639 2.8164 2.2239 1.4954 4.9873 2.5768 3.5943 1.4798 1.3326 2.3947 2.6010 2.1698 2.0571 3.9845 3.0427 2.0740 2.2368 1.1257 2.6126 1.1201 1.6067 1.6138 1.4809 1.4411 2.1433 1.7901 1.2413 1.2367 1.3731 1.4120 2.0998 4.1445 3.7468 1.0851 1.1500 1.1996 1.3183 1.8705 2.8309 5.3547 8.4986 5.3064 7.0457 1.0682 1.0682 1.0638 1.0648 1.0962 1.0969 1.0965 1.0984 1.0883 1.0887 1.0934 1.1000 1.0765
irintensity: 2.5277 1.1509 0.5804 2.0318 0.2383 4.8165 2.3868 2.8538 5.3244 12.0050 9.0461 4.5734 1.1248 2.5473 0.4841 2.0370 3.7177 64.3227 10.1682 16.5304 3.8864 2.1460 7.2390 14.5994 9.0210 0.2757 94.7273 7.6991 4.6269 24.9466 12.6005 0.1101 9.9214 2.1016 83.6664 12.9033 0.6656 23.2162 5.5174 0.8015 30.7535 43.2185 3.8303 3.9747 17.1374 4.6759 6.3560 12.4302 16.9419 67.3276 16.1065 1.0930 82.0599 246.8155 3.3115 13.1745 2.0962 2.7868 45.8389 6.6011 158.0669 5.3661 2.2558 30.8493 25.7885 28.5912 26.1316 902.1297 254.2410 171.5557 166.7966 49.3979 40.4509 41.0261 84.3251 42.2100 37.8242 17.2439 32.3909 8.6159 10.5360 7.2997 25.6899 16.4514
temp: 298.150 k
press: 1.00000 atm
elementType: 8 8 7 7 7 6 6 6 6 6 6 6 6 6 6 6 6 1 1 1 1 1 1 1 1 1 1 1 1 1
symmnumber: 1
zpe: 624152.1 jmol-1
zpe.correction: 0.237727 hartree
zpe.thermalcorrener: 0.251633 hartree
zpe.thermalcorrenthalpy: 0.252577 hartree
zpe.thermalcorrgfe: 0.195827 hartree
zpe.sumelectzpe: -778.548674 hartree
zpe.sumelectthermal: -778.534768 hartree
zpe.sumelectthermalent: -778.533824 hartree
zpe.sumelectthermalfe: -778.590574 hartree
dipole: -1.3568 -7.5592 -0.3937
dipole: 7.6901
quadrupole: -97.4765 -102.6113 -100.5991
quadrupole: -9.0056 1.5480 0.7661
quadrupole: 2.7524 -2.3824 -0.3701 -9.0056 1.5480 0.7661
hfenergy: -778.7864009 hartree
pointgroup: C01 [X(C12H13N3O2)]
dipole: 0.5053395 -2.9624456 -0.3497896 debye
polarizability: 239.1931414|-2.2991484|167.3507278|8.1573171|11.6926252|81.9677508 unknown
InChI: InChI=1S/C12H13N3O2/c16-11-9-3-1-2-4-10(9)13-12(14-11)15-5-7-17-8-6-15/h1-4,13H,5-8H2
charge 0 multiplicity 1
30 atoms
O  4.766213 -0.339531 -0.338187
O  -1.577698 2.85331 0.482312
N  1.98733 -0.182679 0.40336
N  -0.23747 -1.008252 0.145221
N  0.200966 1.336669 0.437121
C  2.639539 -1.496744 0.242791
C  2.922307 0.915542 0.75372
C  3.820086 -1.377193 -0.752786
C  4.07499 0.966321 -0.258903
C  0.625786 0.076502 0.330193
C  -1.628699 -0.805472 0.0256
C  -2.123795 0.524157 0.127369
C  -1.169217 1.659403 0.362925
C  -2.51095 -1.894471 -0.185956
C  -3.516356 0.748864 0.011017
C  -3.892827 -1.647255 -0.297539
C  -4.401403 -0.325345 -0.200822
H  1.943557 -2.259528 -0.1486
H  3.020781 -1.847932 1.223915
H  3.327788 0.730892 1.769325
H  2.339218 1.85093 0.759557
H  4.397536 -2.316199 -0.781353
H  3.424257 -1.151584 -1.767377
H  3.691687 1.246194 -1.262868
H  4.84653 1.68597 0.057385
H  0.110674 -1.96634 0.135333
H  -2.122106 -2.917289 -0.263917
H  -3.866819 1.782946 0.095272
H  -4.578311 -2.485993 -0.461678
H  -5.477693 -0.146095 -0.28983
