program: Gaussian 09
title: 000063125
version: EM64L-G09RevD.01
frameworkgroup: C1[X(C8H7N3O)]
method: RPBEPBE
basis: SDD
operation: Freq
keyword: #pfreq=noraman
keyword: PBEPBE/SDD
title: #p freq=noraman PBEPBE/SDD
converged: YES YES NO YES
title: Mulliken charges:
elementType: O N N N C C C C C C C C H H H H H H H
charge: -0.258545 -0.178712 -0.036226 -0.498036 0.154542 0.070585 0.148142 -0.322529 -0.322621 -0.229070 -0.236537 -0.203273 0.270908 0.261557 0.273648 0.235890 0.235638 0.317334 0.317305
chargesum: 0.00000
title: Mulliken charges with hydrogens summed into heavy atoms:
elementType: O N N N C C C C C C C C
charge: -0.258545 -0.178712 -0.036226 0.136603 0.154542 0.070585 0.148142 -0.051622 -0.061064 0.044578 -0.000647 0.032365
polarizability: 1.63255343e+02 2.51590344e-01 1.16927210e+02 1.80311705e-04 -2.69852532e-03 4.69433985e+01
1716.lowfreq: -5.4485 -0.0004 -0.0001 0.0007 13.5021 14.7186 73.3572 113.2332 134.9591
frequency: 73.2818 113.1966 134.9524 236.7984 267.5342 269.8116 322.1050 423.4187 429.3161 471.7625 483.6012 529.8585 598.9270 600.9827 677.6498 686.0813 759.4287 785.1510 793.8778 821.4962 847.1111 895.7574 916.1203 950.4022 981.9274 1005.3081 1026.1160 1093.2468 1145.7932 1166.2573 1208.5722 1223.0895 1280.2704 1282.8955 1295.7700 1352.1605 1392.8015 1449.5662 1455.8206 1547.7327 1562.9796 1612.9167 1619.1133 1674.3112 3136.6384 3150.6371 3165.7274 3173.4389 3176.0201 3383.9667 3498.3845
redmass: 1.6181 2.3579 3.8256 4.1576 5.2606 5.0643 4.7300 7.5879 3.0483 3.6074 7.5379 6.9189 3.5072 7.1297 6.8069 4.3446 6.2712 1.7322 2.7485 1.7461 6.1464 1.4486 1.4229 4.9718 1.3749 1.3345 2.0190 2.3915 2.4387 1.2783 2.5719 2.8715 1.7148 1.1724 2.4561 1.9897 6.6927 2.5816 2.8101 7.7755 7.2774 8.2970 7.1859 1.1184 1.0862 1.0903 1.0959 1.0940 1.0995 1.0434 1.0978
irintensity: 52.2653 6.5124 8.3793 5.3110 0.2283 1.0791 27.6174 1.8603 11.6383 5.5685 0.6747 2.9354 0.0524 1.8043 12.4592 21.4365 6.5053 69.7811 9.3998 111.3887 9.3904 0.8440 15.3144 0.6644 3.6891 0.0069 5.9766 3.0195 29.0574 11.4457 2.1533 27.7509 7.9254 1.2043 48.1841 0.9421 17.6414 5.0479 49.2816 93.6202 26.0555 269.9382 49.4075 73.4634 4.1864 6.3679 11.7372 0.9019 17.1245 5.9889 8.0279
temp: 298.150 k
press: 1.00000 atm
elementType: 8 7 7 7 6 6 6 6 6 6 6 6 1 1 1 1 1 1 1
symmnumber: 1
zpe: 371740.1 jmol-1
zpe.correction: 0.141588 hartree
zpe.thermalcorrener: 0.151051 hartree
zpe.thermalcorrenthalpy: 0.151995 hartree
zpe.thermalcorrgfe: 0.106676 hartree
zpe.sumelectzpe: -547.679674 hartree
zpe.sumelectthermal: -547.670211 hartree
zpe.sumelectthermalent: -547.669267 hartree
zpe.sumelectthermalfe: -547.714586 hartree
dipole: 0.4157 0.0533 0.0017
dipole: 0.4191
quadrupole: -53.6985 -76.2265 -69.6857
quadrupole: 1.7799 -0.0055 -0.0022
quadrupole: 12.8384 -9.6896 -3.1488 1.7799 -0.0055 -0.0022
hfenergy: -547.8212621 hartree
pointgroup: C01 [X(C8H7N3O1)]
dipole: 0.1629223 0.0253935 0.0006704 debye
dipolederiv: -0.6529041 0.3301309 -0.0000828 0.3955507 -1.0427036 0.0002554 0.0001173 -0.0002503 -0.3599596 -0.1620427 -0.250066 0.0000443 0.2985246 -0.7598182 0.0000646 -0.000119 0.0001938 -0.1115959 -0.9268112 -0.1043162 0.000057 0.0721546 -0.4281051 0.0000023 -0.0000231 -0.0000238 -0.2518569 -0.2479338 -0.0895213 -0.0001281 -0.1233332 -0.297455 -0.0001223 -0.0001051 -0.0000226 -0.0669734 -0.4946582 0.2808018 -0.0000221 0.0686762 -0.1954055 0.000013 0.0000416 0.0000819 -0.0076712 0.6180346 0.3296132 0.0000091 0.060735 0.1844668 -0.000059 -0.0000406 0.0000233 0.0587203 0.8284448 -0.1658894 0.0000359 -0.3280854 1.3838544 -0.0003221 0.0000236 -0.0000206 0.1941872 -0.0265799 -0.2083102 0.0000488 0.070127 0.0128613 -0.0000054 -0.0000763 -0.0000156 -0.103439 -0.2985372 -0.2179087 0.0000175 -0.1201167 0.0875661 -0.0000042 0.0000025 -0.0000351 -0.1421266 0.7507972 -0.1070315 -0.0000533 -0.6965428 0.566776 0.0001203 0.0000044 -0.0000014 0.0289304 -0.0376103 0.2449701 -0.0000034 0.0763785 -0.0591848 0.0000273 -0.0000017 0.0000337 -0.1633838 0.2032827 -0.0203624 0.0000354 -0.0224476 0.1247568 -0.0000251 0.0000506 -0.0000117 -0.1313851 0.0957936 0.0573231 -0.0000116 -0.003169 -0.0086501 0.0000153 -0.0000104 0.0000151 0.1570904 0.0900575 0.0157422 -0.0000097 0.0584198 -0.0403158 0.0000119 0.0000023 0.0000231 0.1617616 0.0286741 -0.0655869 0.0000078 -0.0459225 0.0585839 -0.0000029 -0.0000498 0.0000177 0.1375426 -0.0202763 -0.0951466 -0.0000129 -0.1062737 -0.011572 -0.0000055 -0.0000021 -0.0000176 0.1623222 -0.1139019 0.0479061 -0.0000301 0.0493815 0.0859274 0.0000078 -0.0000427 0.0000061 0.1557821 0.1831327 0.0087583 0.0642698 0.1478139 0.1690761 0.1321524 0.0765364 0.0656793 0.1412384 0.1830385 0.0088936 -0.0641717 0.1481292 0.1693412 -0.132124 -0.0763079 -0.0656752 0.1408164 unknown
polarizability: 163.2080542|1.5006184|116.9744991|0.000253|-0.0026927|46.9433985 unknown
InChI: InChI=1S/C8H7N3O/c9-11-5-10-7-4-2-1-3-6(7)8(11)12/h1-5H,9H2
charge 0 multiplicity 1
19 atoms
O  -1.639935 1.932933 -0.000024
N  -2.020754 -0.379026 0.000056
N  -0.271767 -2.029873 -0.000088
N  -3.439668 -0.192528 0.000279
C  0.280097 0.406059 -0.000143
C  0.67011 -0.976387 -0.000047
C  -1.149899 0.765291 -0.000399
C  1.266586 1.426991 -0.000053
C  2.053776 -1.304051 0.000118
C  -1.546691 -1.694271 -0.000021
C  2.62887 1.085081 0.000118
C  3.019726 -0.284172 0.000201
H  0.93478 2.470467 -0.00016
H  2.330925 -2.362373 0.000191
H  -2.333112 -2.453863 0.000002
H  3.3919 1.870428 0.000172
H  4.083855 -0.544594 0.000338
H  -3.709138 0.339118 -0.841824
H  -3.709161 0.337669 0.843285
