program: Gaussian 09
title: 000063110
version: EM64L-G09RevD.01
frameworkgroup: C1[X(C12H6Cl4)]
method: RPBEPBE
basis: SDD
operation: Freq
keyword: #pfreq=noraman
keyword: PBEPBE/SDD
title: #p freq=noraman PBEPBE/SDD
converged: NO YES NO NO
title: Mulliken charges:
elementType: Cl Cl Cl Cl C C C C C C C C C C C C H H H H H H
charge: 0.021690 -0.016613 0.000922 -0.051155 0.496496 0.291133 -0.263013 -0.326808 -0.326025 -0.326025 -0.106205 -0.218231 -0.218018 -0.198870 -0.198873 -0.107817 0.248684 0.248683 0.267222 0.267090 0.257865 0.257866
chargesum: 0.00000
title: Mulliken charges with hydrogens summed into heavy atoms:
elementType: Cl Cl Cl Cl C C C C C C C C C C C C
charge: 0.021690 -0.016613 0.000922 -0.051155 0.496496 0.291133 -0.263013 -0.326808 -0.077341 -0.077341 -0.106205 0.048991 0.049073 0.058995 0.058993 -0.107817
polarizability: 2.38001255e+02 -1.54477111e+00 1.54738538e+02 -4.50425188e-04 -1.02803236e-02 1.01089862e+02
1716.lowfreq: -13.2618 -4.3978 -2.5480 -0.0028 -0.0017 -0.0015 9.3923 36.7111 45.2372
frequency: -12.7016 36.7020 45.2154 91.1965 121.9165 136.8858 157.2439 194.3360 249.5433 255.6936 287.3508 307.1668 318.0429 352.1633 392.8658 404.4444 442.4354 475.6477 509.2944 529.1247 575.5074 587.8107 625.1070 673.6669 719.6502 745.7672 751.8572 790.9125 807.6775 828.2112 828.8175 942.9461 951.2059 966.0603 990.5025 1010.3884 1071.3184 1092.2855 1106.4130 1131.7655 1161.8155 1184.9114 1251.0276 1291.1212 1338.6770 1353.2760 1371.2172 1387.7101 1417.2882 1480.8368 1547.9957 1576.7083 1577.8124 1601.1883 3146.3122 3147.3646 3165.6855 3171.8291 3175.2795 3184.5701
redmass: 3.9994 21.5815 15.1421 10.7552 8.2757 9.4708 19.2687 31.1349 17.8735 7.2199 7.2442 10.8391 12.0533 4.7724 12.4477 2.8884 5.1048 8.6306 4.7641 4.5755 5.6312 5.3656 6.8851 7.9006 3.9201 8.6968 7.5914 7.0304 1.3409 1.5800 1.2454 1.3393 1.3330 1.3712 7.1282 4.6624 3.0201 5.0864 1.3631 1.5129 1.9253 1.1200 2.6808 1.2492 10.1621 5.6262 3.9758 3.5828 2.6252 2.7957 7.3685 9.0187 7.7285 6.5379 1.0896 1.0894 1.0890 1.0960 1.0972 1.0980
irintensity: 0.0177 0.0297 0.1332 0.8158 0.0188 0.8205 0.3314 0.0200 0.7622 3.8816 0.0593 0.2365 0.3011 2.8619 15.4682 0.0050 11.8321 7.2579 0.8574 1.9385 3.1419 47.1839 0.0414 10.4652 2.6151 0.0560 52.1846 40.5726 43.3515 34.9519 0.0245 0.0027 1.0059 0.0022 12.5287 80.8530 30.6160 24.3217 8.7724 3.2186 46.7360 0.6634 1.0536 0.2451 11.7721 0.1321 57.9689 6.6323 100.9941 43.8642 11.4925 2.6375 1.2348 13.7684 3.4988 5.0565 0.0949 5.6472 0.1523 0.5931
temp: 298.150 k
press: 1.00000 atm
elementType: 17 17 17 17 6 6 6 6 6 6 6 6 6 6 6 6 1 1 1 1 1 1
symmnumber: 1
zpe: 365086.9 jmol-1
zpe.correction: 0.139054 hartree
zpe.thermalcorrener: 0.152666 hartree
zpe.thermalcorrenthalpy: 0.153610 hartree
zpe.thermalcorrgfe: 0.096744 hartree
zpe.sumelectzpe: -2300.006037 hartree
zpe.sumelectthermal: -2299.992426 hartree
zpe.sumelectthermalent: -2299.991481 hartree
zpe.sumelectthermalfe: -2300.048347 hartree
dipole: -1.9780 1.6780 0.0002
dipole: 2.5939
quadrupole: -122.0187 -122.5555 -112.8450
quadrupole: -7.5990 -0.0024 -0.0060
quadrupole: -2.8790 -3.4158 6.2947 -7.5990 -0.0024 -0.0060
hfenergy: -2300.1450911 hartree
pointgroup: C01 [X(C12H6Cl4)]
dipole: -0.8273728 -0.5974249 -0.0000736 debye
dipolederiv: -0.1662493 -0.2113145 -0.0000342 -0.1864829 -0.5902462 -0.0000824 -0.0000103 -0.0000784 -0.0139016 -0.3214598 0.3025388 0.0000526 0.2733427 -0.5954446 -0.0000759 0.0000329 -0.0000842 -0.0401661 -0.4437504 0.3297603 0.0000422 0.4122878 -0.4331751 -0.000054 0.0000516 -0.0000488 -0.026255 -0.9268452 -0.0938432 0.000005 -0.1058028 -0.0774219 0.0000338 0.0000042 0.0000317 -0.125468 0.3391151 0.108111 -0.0000066 0.0346562 -0.3480034 -0.0000147 -0.0000255 -0.0000382 -0.0202784 0.186326 0.0125433 0.0000012 0.0300236 -0.0248715 -0.0000142 -0.0000056 0.0000338 -0.0196723 0.0326324 0.3363133 0.0000599 0.4190313 0.7588893 0.000129 0.000046 0.0001062 -0.0322999 0.3188598 -0.4800408 -0.0000846 -0.3940201 0.8528008 0.0001381 -0.0000387 0.0001319 -0.0645116 -0.0536039 0.0100155 0.0619724 0.0078538 -0.0823068 0.0049155 -0.1175397 -0.0083456 0.0827853 -0.0535824 0.0100787 -0.0619447 0.0076244 -0.0823161 -0.0051311 0.1175669 0.0081629 0.0827851 0.4819975 -0.5426212 -0.0000701 -0.7285904 0.4615864 0.0000579 -0.0001156 0.0000611 -0.0524336 -0.1283018 0.124921 0.000021 0.0720329 -0.1549838 -0.0000155 0.0000462 -0.0000067 -0.1017649 -0.0956239 0.0720009 0.0000143 0.1395166 -0.0711203 0.0000028 0.0000288 0.0000023 -0.0919056 -0.3538185 -0.0269499 -0.0988275 -0.0335775 -0.1013583 -0.011422 -0.0683109 -0.0082526 -0.0114218 -0.3537998 -0.0270443 0.0988486 -0.0336282 -0.1013766 0.0113169 0.0683318 0.0081277 -0.0114266 1.3476426 0.1609254 0.0000027 0.1743817 -0.0452441 -0.0001165 0.0000002 -0.0001027 0.1399216 0.0437054 -0.0125695 -0.0823939 -0.0088742 0.127849 -0.0093169 -0.0856841 -0.0081695 -0.0139862 0.0437314 -0.012665 0.0823714 -0.0089676 0.1278288 0.0094941 0.0856678 0.0083198 -0.0139912 0.057873 -0.0249439 -0.0000025 -0.0393698 -0.0107676 -0.0000198 -0.0000114 -0.0000202 0.1655328 -0.0232557 -0.0082883 -0.0000029 -0.0006538 0.0775047 -0.0000105 -0.0000118 -0.0000077 0.165591 0.034215 -0.013498 0.0649969 -0.0154358 0.1560798 0.0079338 0.0604737 0.00704 0.0014318 0.0341926 -0.0134295 -0.0650213 -0.0153482 0.1560974 -0.0077482 -0.0604964 -0.0068629 0.0014354 unknown
polarizability: 237.7342478|-4.9544729|155.0055453|-0.0003535|-0.0102841|101.0898625 unknown
InChI: InChI=1S/C12H6Cl4/c13-8-3-1-7(2-4-8)11-9(14)5-6-10(15)12(11)16/h1-6H
charge 0 multiplicity 1
22 atoms
Cl -0.925629 2.522212 0.000364
Cl -0.271805 -3.023636 -0.000329
Cl -4.151388 2.093605 0.000298
Cl 5.352614 0.489575 -0.000055
C  -0.737644 -0.261051 0.000011
C  0.751658 -0.075926 -0.000013
C  -1.624061 0.851893 0.000146
C  -1.334187 -1.548243 -0.000123
C  1.462701 0.011373 -1.222467
C  1.462895 0.009967 1.222425
C  -3.026277 0.675436 0.000126
C  -2.729123 -1.74291 -0.000139
C  -3.580205 -0.620061 -0.000023
C  2.864256 0.183316 -1.230566
C  2.864451 0.181907 1.230503
C  3.544183 0.266295 -0.000038
H  0.924133 -0.05301 -2.173816
H  0.924478 -0.055508 2.173785
H  -3.144844 -2.753681 -0.000256
H  -4.666483 -0.74551 -0.000054
H  3.414114 0.251425 -2.173648
H  3.414464 0.248934 2.173571
