program: Gaussian 09
title: 000063104
version: EM64L-G09RevD.01
frameworkgroup: C1[X(C12H6Cl4)]
method: RPBEPBE
basis: SDD
operation: Freq
keyword: #pfreq=noraman
keyword: PBEPBE/SDD
title: #p freq=noraman PBEPBE/SDD
converged: NO YES NO NO
title: Mulliken charges:
elementType: Cl Cl Cl Cl C C C C C C C C C C C C H H H H H H
charge: -0.006506 -0.042141 -0.043471 0.002879 0.380764 0.388092 -0.346544 -0.390137 -0.364180 -0.358603 -0.089620 -0.210446 -0.090963 -0.087763 -0.111275 -0.241333 0.270446 0.250920 0.269962 0.271309 0.261887 0.286724
chargesum: 0.00000
title: Mulliken charges with hydrogens summed into heavy atoms:
elementType: Cl Cl Cl Cl C C C C C C C C C C C C
charge: -0.006506 -0.042141 -0.043471 0.002879 0.380764 0.388092 -0.076098 -0.139217 -0.094218 -0.087294 -0.089620 0.051441 -0.090963 -0.087763 -0.111275 0.045391
polarizability: 2.77499652e+02 -1.03611351e+00 1.84332039e+02 2.08614121e+00 6.18157472e+00 7.11393095e+01
1716.lowfreq: -4.9194 -0.0017 -0.0015 0.0023 3.9632 5.1069 29.4290 47.4027 64.9746
frequency: 29.3925 47.3963 64.9729 123.3834 149.2026 158.9327 183.6587 192.1228 205.9658 219.1179 250.0223 303.1533 355.2176 378.1586 408.5016 423.9967 436.4961 468.5911 495.5370 516.7308 549.6694 604.2759 656.4204 680.2707 699.4897 705.5551 755.7032 822.5911 835.4213 862.7330 873.5269 885.3529 893.8280 953.8848 978.7036 1000.8064 1059.1559 1097.4726 1111.4144 1125.2440 1153.7571 1250.9381 1264.8205 1286.7438 1334.2557 1365.0807 1390.7257 1413.3104 1426.6756 1475.4845 1549.1349 1567.0874 1595.7440 1597.2390 3149.5522 3161.0950 3169.3502 3171.7357 3173.9095 3186.8929
redmass: 13.8472 12.1025 12.8988 7.6401 24.8358 7.0280 23.8162 7.1628 4.9538 7.4947 13.8308 6.2443 8.2178 12.2397 8.7952 8.0605 3.2528 5.1401 7.7942 5.2922 5.0600 4.9758 7.1769 2.5966 8.0795 3.2576 10.1982 1.3755 7.5006 1.4778 1.4115 1.3678 1.6118 1.3623 6.1019 5.6911 3.6597 1.4905 2.0738 2.2313 1.4633 1.3615 1.2312 2.4501 3.6050 11.0497 4.9465 3.0837 2.7266 3.4163 6.5749 8.1834 6.7124 7.1056 1.0887 1.0921 1.0918 1.0945 1.0951 1.0940
irintensity: 0.1681 0.2952 0.3907 0.1353 0.2003 0.2517 0.0445 0.0461 0.0478 0.2746 0.5834 1.0032 2.9316 7.4691 4.3527 3.1703 6.5734 7.3481 18.0939 0.8343 1.2629 10.0254 5.8524 12.6830 25.4507 1.8354 99.9505 45.9821 38.2501 41.1698 19.7304 0.5776 1.2369 1.0683 4.4595 34.7975 34.6367 8.9022 36.2704 39.3424 0.3171 0.1526 0.1060 7.0317 25.5150 0.8940 10.8118 28.6602 93.0910 50.3519 128.2472 33.4110 6.8309 104.7930 4.3683 1.2740 0.0905 1.1475 1.5132 2.8744
temp: 298.150 k
press: 1.00000 atm
elementType: 17 17 17 17 6 6 6 6 6 6 6 6 6 6 6 6 1 1 1 1 1 1
symmnumber: 1
zpe: 366330.1 jmol-1
zpe.correction: 0.139528 hartree
zpe.thermalcorrener: 0.153860 hartree
zpe.thermalcorrenthalpy: 0.154804 hartree
zpe.thermalcorrgfe: 0.095917 hartree
zpe.sumelectzpe: -2300.014632 hartree
zpe.sumelectthermal: -2300.000300 hartree
zpe.sumelectthermalent: -2299.999355 hartree
zpe.sumelectthermalfe: -2300.058242 hartree
dipole: 0.6104 -1.3039 -0.5666
dipole: 1.5472
quadrupole: -132.3546 -117.1652 -122.2513
quadrupole: 3.4973 1.5071 2.8516
quadrupole: -8.4309 6.7585 1.6724 3.4973 1.5071 2.8516
hfenergy: -2300.1541598 hartree
pointgroup: C01 [X(C12H6Cl4)]
dipole: 0.2209271 -0.527717 -0.2079657 debye
dipolederiv: -0.3167383 0.2520993 0.1013485 0.3731228 -0.4449375 -0.1673885 0.1467396 -0.1646146 -0.0970115 -0.3122572 -0.2567802 0.0490176 -0.3604176 -0.6562917 0.1253517 0.0718789 0.1229725 -0.0840481 -0.4219532 0.3067746 -0.0790217 0.3961024 -0.5604163 0.1258885 -0.1060724 0.124279 -0.0908079 -0.8952955 -0.103929 -0.0336421 -0.1158177 -0.0660772 -0.0157224 -0.0430013 -0.0139063 -0.0303913 0.2548478 0.0257786 0.0046841 -0.0011528 0.0023402 0.0408305 -0.0076946 0.0073724 0.0068666 0.5118755 0.0112028 0.0105186 0.0438475 0.1842587 -0.0676519 0.0172298 -0.034284 0.026886 -0.2311916 0.1443171 0.0614756 0.0465865 -0.1515567 -0.0082414 0.0837766 -0.0150965 -0.094112 -0.1110356 -0.0369845 -0.0268681 0.0222118 -0.0130243 0.0681525 -0.0558922 0.0604609 -0.1165997 -0.4791113 0.1557108 -0.0470601 0.1845243 -0.2262743 0.0142161 -0.1011706 0.0157236 -0.1257953 -0.417264 -0.1657926 0.0395766 -0.2253836 -0.2867986 0.0135823 0.0810307 0.0231045 -0.1185586 0.1948379 -0.5229702 -0.2067347 -0.6131603 0.6523307 0.2749451 -0.2705945 0.2713835 0.0768666 -0.2575162 -0.0375551 -0.0102748 0.0886736 0.0236552 0.0396748 0.0618979 0.0459845 -0.0622906 0.5646804 0.370579 -0.0590737 0.5751335 1.0355195 -0.2254011 -0.1419914 -0.2244532 0.0068673 0.7300338 -0.4373637 0.1203301 -0.6126146 0.8859402 -0.2277832 0.2096112 -0.2191361 0.017476 1.1362683 0.2878884 0.1039842 0.2106648 -0.0856056 -0.0188662 0.080017 -0.0152474 -0.0659271 -0.322272 0.0261023 -0.0113946 0.0126015 -0.5319566 0.1090132 -0.0127279 0.0979839 -0.109964 0.0858653 -0.0587238 -0.022474 -0.0627927 0.0293716 -0.050219 -0.0345664 -0.0396746 0.1297444 0.0340889 0.085282 0.0372484 0.0834905 0.0249808 -0.055369 0.047253 -0.0448007 0.1257283 0.1004044 -0.0647456 0.010735 -0.0722039 0.018469 0.0349083 0.0274943 0.0253935 0.1466469 0.0766051 0.0673391 -0.0215644 0.0814677 0.0387667 0.0327713 -0.033787 0.0248762 0.1451988 0.0439151 -0.0408969 -0.016194 -0.0475693 0.0148048 -0.0574691 -0.015208 -0.0585655 0.1395297 0.0312124 -0.0073323 -0.0046166 -0.0073143 0.1125017 0.0147773 -0.0042225 0.0102445 0.1736955 unknown
polarizability: 277.3569784|-4.0143757|184.7815182|0.3082205|2.4152151|70.8325039 unknown
InChI: InChI=1S/C12H6Cl4/c13-9-3-8(4-10(14)6-9)7-1-2-11(15)12(16)5-7/h1-6H
charge 0 multiplicity 1
22 atoms
Cl -3.863179 2.14052 0.849945
Cl 3.65502 2.879361 -0.554514
Cl 4.101076 -2.527792 0.627736
Cl -5.264184 -0.647508 -0.202129
C  -0.628778 -0.2218 -0.073621
C  0.856228 -0.08879 -0.035663
C  -1.460349 0.854397 0.334642
C  -1.250698 -1.421224 -0.517008
C  1.673779 -1.219718 0.23754
C  1.476975 1.168058 -0.273901
C  -2.861804 0.73449 0.299989
C  -2.653094 -1.540457 -0.552047
C  2.878232 1.266303 -0.23388
C  3.071212 -1.072657 0.264578
C  -3.465661 -0.462434 -0.142924
C  3.710356 0.161191 0.03305
H  -1.023333 1.782095 0.716271
H  -0.640145 -2.257719 -0.871128
H  1.225118 -2.191313 0.46114
H  0.877551 2.048009 -0.522838
H  -3.126152 -2.461088 -0.905939
H  4.798329 0.256276 0.059098
