program: Gaussian 09
title: 000063093
version: EM64L-G09RevD.01
frameworkgroup: C1[X(C12H5Cl5)]
method: RPBEPBE
basis: SDD
operation: Freq
keyword: #pfreq=noraman
keyword: PBEPBE/SDD
title: #p freq=noraman PBEPBE/SDD
converged: YES YES NO NO
title: Mulliken charges:
elementType: Cl Cl Cl Cl Cl C C C C C C C C C C C C H H H H H
charge: 0.027079 0.016521 0.003179 -0.034215 -0.006381 0.441829 0.407348 -0.304883 -0.357338 -0.272387 -0.367355 -0.047916 -0.082720 -0.080322 -0.214555 -0.229846 -0.231510 0.281636 0.257153 0.242739 0.287871 0.264072
chargesum: 0.00000
title: Mulliken charges with hydrogens summed into heavy atoms:
elementType: Cl Cl Cl Cl Cl C C C C C C C C C C C C
charge: 0.027079 0.016521 0.003179 -0.034215 -0.006381 0.441829 0.407348 -0.304883 -0.075702 -0.272387 -0.110201 -0.047916 -0.082720 -0.080322 0.028184 0.058024 0.032562
polarizability: 2.28098946e+02 -6.59473574e+00 1.64961390e+02 1.24577836e+01 9.93800479e+00 1.33239224e+02
1716.lowfreq: 0.0024 0.0025 0.0034 2.3797 3.4591 7.1401 17.6662 42.7483 45.2153
frequency: 17.6231 42.7478 45.2151 81.2689 101.7159 150.1226 161.8996 190.4651 194.5538 203.6426 216.8141 253.2686 272.0609 307.6228 315.4795 360.9544 388.3810 434.6761 450.9819 463.0281 506.9016 533.7799 540.7181 583.9544 600.2878 655.7112 712.4695 724.9733 730.1660 773.7157 794.2315 836.8393 865.1350 884.8600 907.9275 975.9619 999.8325 1024.8116 1074.7182 1105.9747 1124.4647 1152.7428 1182.5658 1201.7889 1280.8366 1349.3184 1353.0419 1375.6394 1403.2016 1405.0711 1454.6413 1551.1675 1560.7583 1580.7551 1596.7813 3147.2952 3162.5199 3174.7172 3179.0143 3185.2722
redmass: 11.7468 16.9703 17.0494 21.3832 11.7318 13.7817 10.9209 23.3332 27.6924 4.9475 5.6568 11.5706 7.4762 9.7119 23.8386 8.1798 9.2417 7.3545 9.4365 7.1293 4.0375 8.9183 5.1965 5.0041 5.7659 8.4182 6.8372 3.2410 4.7488 4.9164 1.8444 8.4690 1.4313 1.4320 1.3756 1.3402 8.4280 6.5242 3.4530 1.7868 2.1612 1.6732 1.7674 1.3809 2.0813 9.4140 9.5860 3.3611 3.0000 2.7500 3.7668 7.3045 6.6124 8.3988 7.7514 1.0873 1.0928 1.0933 1.0996 1.0938
irintensity: 0.4690 0.1466 0.1516 0.0935 0.3964 0.1921 0.6061 0.0025 0.0529 0.2937 0.4218 0.1186 1.8995 0.9171 0.2004 2.1564 3.8224 1.5377 8.9360 5.6983 0.1259 33.1292 4.8077 3.4062 8.7288 22.8303 29.4829 17.0033 11.7348 79.8601 14.0971 10.2570 24.3431 6.1996 0.6987 0.2064 72.9251 17.5766 11.6041 32.6121 14.8895 13.3151 7.0939 2.6550 5.7204 3.5831 5.3714 49.5561 63.5121 75.1289 9.3165 56.6532 15.5422 45.2652 1.8983 3.0030 4.3204 0.0724 7.0288 1.7730
temp: 298.150 k
press: 1.00000 atm
elementType: 17 17 17 17 17 6 6 6 6 6 6 6 6 6 6 6 6 1 1 1 1 1
symmnumber: 1
zpe: 340380.0 jmol-1
zpe.correction: 0.129644 hartree
zpe.thermalcorrener: 0.145400 hartree
zpe.thermalcorrenthalpy: 0.146344 hartree
zpe.thermalcorrgfe: 0.083550 hartree
zpe.sumelectzpe: -2759.390192 hartree
zpe.sumelectthermal: -2759.374436 hartree
zpe.sumelectthermalent: -2759.373492 hartree
zpe.sumelectthermalfe: -2759.436286 hartree
dipole: 0.4574 1.8571 2.7143
dipole: 3.3205
quadrupole: -127.7095 -135.5134 -127.1156
quadrupole: 3.4480 8.5599 4.1263
quadrupole: 2.4033 -5.4006 2.9973 3.4480 8.5599 4.1263
hfenergy: -2759.519836 hartree
pointgroup: C01 [X(C12H5Cl5)]
dipole: -0.2986598 0.4387051 -1.1937089 debye
dipolederiv: -0.205584 -0.2518941 0.0066132 -0.2578755 -0.5233312 0.0291276 0.0059024 0.0298422 -0.0084088 -0.1573201 0.003264 -0.1925284 0.0038674 -0.0134278 0.0132401 -0.1911572 0.0123803 -0.5621949 -0.3397103 0.3085494 -0.0771219 0.3435519 -0.4832074 0.1031716 -0.09332 0.1092878 -0.0506082 -0.3290616 -0.2985783 0.0202453 -0.3590305 -0.6707736 0.061794 0.0191809 0.0616124 -0.0585095 -0.4616537 -0.0195551 0.3122079 -0.0290863 -0.0330039 0.0236658 0.3945928 0.0213441 -0.3871735 0.3312299 -0.072093 -0.0165509 -0.0982998 0.0002596 -0.00993 0.0204487 -0.0155007 -0.0063529 0.2744692 -0.0450335 -0.0178651 -0.0378645 -0.029856 -0.0000208 -0.0831745 0.0075899 -0.1216369 -0.011656 0.4767262 -0.0347186 0.5251034 0.6000354 0.0051495 -0.0634728 -0.0302337 -0.0464212 -0.2978115 -0.1278169 0.012694 -0.1180514 -0.2230691 0.0142392 -0.0224925 0.0253902 -0.0887244 -0.0463321 -0.0027073 0.3726626 -0.0002199 -0.0250886 -0.0297191 0.397372 -0.0056528 0.7230028 -0.1466745 0.008843 -0.0325773 -0.0233716 -0.1180451 0.0071965 0.0059763 -0.001372 0.017744 0.4810771 -0.4639109 0.1182868 -0.616724 0.625211 -0.1777222 0.154783 -0.1617395 0.0189787 0.4748693 0.4510663 -0.0117366 0.5404455 1.0145953 -0.1162117 0.0125593 -0.1147243 -0.0310954 0.5698875 0.0322912 -0.5239716 0.0484374 -0.0300661 -0.0348252 -0.718259 -0.0405942 0.4219598 0.0178202 0.0041786 0.0255902 0.0284265 -0.134193 -0.0088386 0.0343955 -0.0135308 0.0784496 -0.2067007 -0.0308008 0.0015451 0.0180025 -0.439242 0.0636191 -0.0171496 0.0551461 -0.0797056 -0.0993776 0.0026042 0.0628424 -0.0047782 -0.1014905 0.0036616 0.1621235 0.0066212 -0.1494089 0.0872392 0.0432992 -0.0229474 0.0661432 0.0334224 0.0164759 -0.0204116 0.0217757 0.134773 0.032548 -0.0113286 0.0857686 -0.009646 0.1341172 0.008667 0.0940092 0.0024538 0.0103121 0.0340738 0.0019451 -0.0496129 -0.0006415 0.1582713 0.0122859 -0.0611399 0.0134318 -0.0685316 0.0330491 -0.0069554 -0.0170349 -0.009932 0.0961733 0.0096683 -0.0189921 0.0126892 0.1653131 -0.0343812 -0.0020932 -0.0217906 -0.0084565 0.1627086 0.0053057 -0.0117744 0.0037833 0.0882387 unknown
polarizability: 228.5642373|10.5513352|159.0753364|3.4560598|-16.8710815|138.6599861 unknown
InChI: InChI=1S/C12H5Cl5/c13-6-4-8(12(17)10(15)5-6)7-2-1-3-9(14)11(7)16/h1-5H
charge 0 multiplicity 1
22 atoms
Cl 0.478088 -2.635668 0.169718
Cl -1.19732 -0.048284 2.339055
Cl 3.702777 -2.436695 0.600152
Cl 3.493681 3.016276 -0.294533
Cl -4.404617 -0.099589 1.768491
C  0.568935 0.127813 -0.220433
C  -0.913909 0.091733 -0.436396
C  1.321213 -1.042702 0.061593
C  1.246374 1.367483 -0.333758
C  -1.829229 0.012973 0.64542
C  -1.427494 0.170356 -1.755142
C  2.720293 -0.962401 0.240315
C  2.639824 1.418799 -0.152988
C  -3.220268 -0.001073 0.40241
C  -2.818133 0.156117 -1.993546
C  3.396727 0.270226 0.137115
C  -3.721519 0.067734 -0.913617
H  0.677188 2.275995 -0.547106
H  -0.723296 0.229757 -2.591059
H  -3.201606 0.210308 -3.016901
H  4.478882 0.320581 0.278019
H  -4.802491 0.053762 -1.079709
