program: Gaussian 09
title: 000063088
version: EM64L-G09RevD.01
frameworkgroup: C1[X(C12H5Cl5)]
method: RPBEPBE
basis: SDD
operation: Freq
keyword: #pfreq=noraman
keyword: PBEPBE/SDD
title: #p freq=noraman PBEPBE/SDD
converged: NO NO NO NO
title: Mulliken charges:
elementType: Cl Cl Cl Cl Cl C C C C C C C C C C C C H H H H H
charge: -0.022669 0.001220 0.001225 0.047303 -0.039117 0.335185 0.402674 -0.367648 -0.367605 -0.341735 -0.334802 -0.039173 -0.039159 -0.102985 -0.100327 -0.187961 -0.213825 0.279356 0.279357 0.279587 0.265165 0.265935
chargesum: 0.00000
title: Mulliken charges with hydrogens summed into heavy atoms:
elementType: Cl Cl Cl Cl Cl C C C C C C C C C C C C
charge: -0.022669 0.001220 0.001225 0.047303 -0.039117 0.335185 0.402674 -0.088293 -0.088249 -0.341735 -0.055215 -0.039173 -0.039159 -0.102985 -0.100327 0.077204 0.052110
polarizability: 2.48458134e+02 1.21375078e-01 1.44326737e+02 -9.04174251e+00 1.18143300e-02 1.40755807e+02
1716.lowfreq: -20.6802 -0.0027 -0.0009 0.0010 1.5917 6.8573 7.2881 40.0251 55.8488
frequency: -20.5739 40.0248 55.8470 75.9059 89.2067 140.9934 174.3778 186.9914 194.4945 194.8775 210.5352 266.6898 300.2391 302.6187 311.5822 334.7107 399.6349 409.8014 451.6098 483.4086 500.7830 511.4062 525.5727 590.9787 628.9337 647.2035 701.2857 717.0176 720.3084 765.1107 815.6491 845.0948 882.6433 888.3116 893.1056 950.5501 1000.6601 1015.3917 1077.2417 1084.8991 1135.3295 1145.4009 1193.1508 1242.2902 1271.4138 1339.8466 1354.0563 1368.9739 1373.8714 1420.8908 1459.3231 1542.2687 1558.9009 1583.2714 1600.2906 3163.1698 3165.6356 3170.2938 3172.6813 3182.2391
redmass: 17.3879 17.5498 7.9164 31.1932 10.1702 27.1601 12.8561 5.1207 22.2370 14.9894 8.1825 10.2384 7.2771 7.7088 28.0216 26.9442 5.3234 5.3398 4.3838 5.6234 10.5264 5.3540 9.1279 4.9243 7.3427 7.4919 3.6020 4.7471 7.8016 8.3815 1.3481 8.0603 1.5740 1.4388 1.3575 1.3417 8.2173 6.2581 4.5972 1.8156 1.3979 2.1241 1.6342 1.5432 2.0972 5.1987 8.0988 4.0805 3.2803 3.0240 3.7477 8.8806 6.9048 7.4186 7.9778 1.0891 1.0929 1.0927 1.0939 1.0978
irintensity: 0.0174 0.0204 0.0101 0.0009 0.8197 0.2691 0.0228 0.0166 0.4588 0.1281 0.0668 1.8194 0.1434 1.7269 0.0091 0.8956 0.8532 5.7712 18.9774 1.6428 40.0494 0.0027 11.6360 2.9538 13.1933 1.7652 9.3326 5.5629 4.1404 76.0547 43.4083 15.5909 17.7042 6.6946 2.4678 0.0002 24.8679 69.5414 17.1630 26.2923 4.8804 38.9710 13.6289 7.7435 7.2017 19.1062 4.4012 29.3139 25.5393 130.6928 30.9988 73.9699 10.3087 22.1434 0.3864 0.2860 0.1763 0.2320 0.0401 1.1939
temp: 298.150 k
press: 1.00000 atm
elementType: 17 17 17 17 17 6 6 6 6 6 6 6 6 6 6 6 6 1 1 1 1 1
symmnumber: 1
zpe: 339912.9 jmol-1
zpe.correction: 0.129466 hartree
zpe.thermalcorrener: 0.144364 hartree
zpe.thermalcorrenthalpy: 0.145308 hartree
zpe.thermalcorrgfe: 0.085504 hartree
zpe.sumelectzpe: -2759.391684 hartree
zpe.sumelectthermal: -2759.376786 hartree
zpe.sumelectthermalent: -2759.375842 hartree
zpe.sumelectthermalfe: -2759.435646 hartree
dipole: 3.0360 -0.0074 0.5280
dipole: 3.0816
quadrupole: -132.3060 -132.9303 -133.7172
quadrupole: -0.0904 6.7521 0.0090
quadrupole: 0.6785 0.0542 -0.7327 -0.0904 6.7521 0.0090
hfenergy: -2759.5211501 hartree
pointgroup: C01 [X(C12H5Cl5)]
dipole: -1.2012456 -0.0010736 -0.1639763 debye
dipolederiv: -0.2940733 0.0015321 0.2688016 0.0014846 -0.0433131 -0.0031968 0.2566823 -0.003179 -0.6024794 -0.2427284 -0.2565477 -0.0160786 -0.3252759 -0.6003342 -0.0228882 -0.0178554 -0.0210714 -0.0273774 -0.2427736 0.2563846 -0.0188118 0.3250451 -0.5997229 0.0289797 -0.0213008 0.0271445 -0.0279071 -0.7200234 -0.0003304 -0.0593761 -0.0003255 -0.0056902 0.000051 -0.062726 0.0000414 0.0024985 -0.4158434 0.0017996 0.3101843 0.0025485 -0.0550501 -0.003175 0.4344361 -0.0031548 -0.5984413 0.3311563 0.0003918 0.0628405 0.0005926 0.1887235 -0.0012337 0.0859824 -0.001188 -0.0381651 0.3441492 0.0008702 0.1465445 0.0003466 -0.0712645 -0.0001745 0.0657362 -0.0002431 -0.1061578 -0.3029558 0.1610915 -0.0219468 0.0254987 -0.1986447 0.0098579 -0.0096027 0.029439 -0.0704436 -0.3029603 -0.161288 -0.020197 -0.0256065 -0.1990873 -0.0084872 -0.0092967 -0.0280349 -0.0700717 0.2002495 -0.0027952 -0.4878318 -0.0020364 -0.0656253 0.0051293 -0.3596346 0.0051509 0.8371963 -0.2897917 0.000562 0.1004844 0.0005132 -0.0775233 -0.0004908 0.0961986 -0.0004511 -0.1536012 0.1781778 0.4364211 0.0108999 0.4203946 0.9115491 0.0285451 0.0034355 0.0345058 -0.0152526 0.1782908 -0.4363701 0.0155417 -0.4203829 0.9106732 -0.0383616 0.0079235 -0.0443102 -0.0144283 0.9417758 0.0004629 0.0796209 0.0005266 -0.3814807 0.0017647 0.0866703 0.0017701 -0.0464696 0.4967065 -0.0030351 -0.5166462 -0.0038274 -0.058538 0.0054966 -0.6548642 0.0054632 0.8788361 -0.072459 0.0006316 0.1080038 0.0004214 -0.0833847 -0.0001765 0.0731436 -0.0001959 -0.1221173 -0.0671062 0.0006751 0.1133979 0.0007709 -0.1064091 -0.0005592 0.128191 -0.0005387 -0.198193 0.0806974 -0.0485293 -0.0028583 -0.0645147 0.0339655 -0.0048509 0.0015749 -0.008331 0.1404116 0.0806508 0.0484934 -0.00338 0.0645142 0.0340823 0.0059647 0.0009374 0.0093614 0.1402683 0.099916 -0.000225 -0.0389259 -0.0004339 0.1399817 -0.0007472 -0.0703711 -0.0007418 0.0113808 0.0516658 -0.0001898 -0.0310553 -0.0003066 0.1602576 -0.001004 -0.046063 -0.000998 -0.0101658 -0.0327208 -0.0000052 0.0007883 0.000053 0.1668354 -0.0004435 0.0108025 -0.0004382 0.0906795 unknown
polarizability: 247.6545938|-0.0778558|144.3267449|-12.948318|0.01991|141.5593385 unknown
InChI: InChI=1S/C12H5Cl5/c13-7-1-2-9(14)8(5-7)6-3-10(15)12(17)11(16)4-6/h1-5H
charge 0 multiplicity 1
22 atoms
Cl -0.955744 -0.016622 -2.910132
Cl 3.241722 2.803953 0.234398
Cl 3.241982 -2.801026 0.264164
Cl 4.898213 0.002249 0.388346
Cl -4.401457 0.014651 2.510338
C  0.266111 -0.000054 -0.008438
C  -1.231343 -0.000632 -0.115794
C  0.976463 -1.221829 0.060296
C  0.976357 1.222452 0.047221
C  -1.909178 -0.007788 -1.360722
C  -2.017781 0.006208 1.066016
C  2.379204 1.214815 0.167423
C  2.379313 -1.212775 0.180368
C  3.103848 0.00138 0.2355
C  -3.422337 0.005712 0.978522
C  -3.316241 -0.008366 -1.444944
C  -4.087943 -0.001536 -0.262858
H  0.446379 -2.177101 0.015421
H  0.446197 2.177148 -0.007818
H  -1.521309 0.011835 2.040861
H  -3.807029 -0.014087 -2.422302
H  -5.180229 -0.00189 -0.313366
