program: Gaussian 09
title: 000007450
version: EM64L-G09RevD.01
frameworkgroup: C1[X(C12H18)]
method: RPBEPBE
basis: SDD
operation: Freq
keyword: #p
keyword: freq=noraman
keyword: PBEPBE/SDD
title: #p freq=noraman PBEPBE/SDD
converged: NO NO NO NO
title: Mulliken charges:
elementType: C C C C C C C C C C C C H H H H H H H H H H H H H H H H H H
charge: -0.248794 -0.248800 0.549726 0.549731 -0.568224 -0.486301 -0.486301 -0.693122 -0.693125 -0.693111 -0.693134 -0.210420 0.206229 0.206230 0.227454 0.233900 0.233900 0.227207 0.210559 0.210498 0.227208 0.210557 0.210500 0.210556 0.210507 0.227205 0.227208 0.210558 0.210496 0.221105
chargesum: 0.00000
title: Mulliken charges with hydrogens summed into heavy atoms:
elementType: C C C C C C C C C C C C
charge: -0.042565 -0.042570 0.549726 0.549731 -0.340771 -0.252401 -0.252402 -0.044859 -0.044860 -0.044842 -0.044873 0.010685
polarizability: 1.53076383e+02 -2.17679258e-04 1.35416796e+02 1.39264645e-03 1.90472470e-03 9.23349663e+01
1716.lowfreq: -16.0150 -10.3062 -8.7488 -0.0007 -0.0005 0.0004 20.4148 39.6362 95.7566
frequency: 15.1322 39.4654 95.6313 123.7702 147.1880 222.8265 223.5760 230.5636 257.0261 278.6175 297.6478 298.8711 306.8016 330.5878 452.0273 461.8251 477.2747 545.9633 561.6331 636.1478 685.3342 714.7289 809.1097 818.8358 884.1197 906.5809 908.6275 915.3728 917.9757 918.6201 952.8577 953.4314 979.6263 988.6224 1053.6067 1084.0567 1085.5417 1111.7932 1112.0581 1130.9112 1159.4275 1180.4557 1195.1828 1245.5370 1277.2494 1305.5759 1306.1006 1333.7851 1343.3579 1372.6113 1373.2601 1384.3816 1391.5100 1392.1226 1442.6076 1465.0761 1465.7205 1467.5508 1470.1876 1471.7310 1477.2917 1477.7764 1489.5182 1489.6775 1593.6625 1612.3693 2969.4646 2969.7005 2972.1100 2972.5186 2975.4175 2975.7529 3061.8230 3062.1466 3068.8173 3069.4898 3072.6677 3072.8863 3077.0488 3077.1515 3105.9487 3109.6418 3119.0696 3145.4078
redmass: 2.5914 2.8935 3.0165 2.9891 3.0458 1.0420 1.0287 1.4577 1.0432 1.6096 3.1183 2.7424 2.6165 3.2892 2.8471 3.0013 2.9271 2.8012 3.0085 4.4371 4.7901 1.7458 1.5569 2.9502 2.5809 1.3006 1.5620 1.1853 2.2847 1.2401 1.4719 1.4642 1.3514 5.9985 1.5310 1.4466 1.9153 2.5585 2.5742 1.8550 1.8102 1.1123 1.7224 1.8062 1.4398 1.3198 1.3212 2.2979 1.5735 1.1942 1.1937 2.4823 1.2118 1.4109 2.3046 1.0463 1.0462 1.0496 1.0500 1.9178 1.0501 1.0482 1.0712 1.2244 6.0141 6.0620 1.0346 1.0346 1.0353 1.0357 1.0839 1.0834 1.1000 1.1000 1.0993 1.0991 1.1004 1.1004 1.0996 1.0995 1.0890 1.0861 1.0916 1.0990
irintensity: 0.0000 0.0108 1.3641 0.1319 0.0000 0.0000 0.0012 0.0970 0.0453 0.0019 0.0000 0.4947 0.0264 0.3076 0.0033 0.4791 9.7945 0.0094 0.0264 0.0000 0.0049 35.6127 31.7409 9.7364 2.3454 0.0000 11.2921 3.1885 13.0575 0.0002 0.0000 0.1032 0.7990 0.0016 3.1828 15.7492 20.8021 2.9165 0.0003 5.9454 0.6122 2.0306 10.4027 0.9024 12.3134 0.0000 1.5864 4.0206 1.4875 0.0003 29.4220 0.0007 21.1517 0.0048 8.9974 0.0000 8.8950 0.0000 2.7134 0.3971 7.5498 21.7438 0.4414 41.5211 10.1809 21.7649 0.0024 64.1499 13.6086 56.5616 27.0164 10.1165 0.0006 0.4475 217.6765 0.2996 0.0006 50.0890 0.0080 75.5010 20.7225 5.1321 31.5538 31.1224
temp: 298.150 k
press: 1.00000 atm
elementType: 6 6 6 6 6 6 6 6 6 6 6 6 1 1 1 1 1 1 1 1 1 1 1 1 1 1 1 1 1 1
symmnumber: 1
zpe: 693805.2 jmol-1
zpe.correction: 0.264256 hartree
zpe.thermalcorrener: 0.277571 hartree
zpe.thermalcorrenthalpy: 0.278515 hartree
zpe.thermalcorrgfe: 0.223686 hartree
zpe.sumelectzpe: -467.159461 hartree
zpe.sumelectthermal: -467.146146 hartree
zpe.sumelectthermalent: -467.145202 hartree
zpe.sumelectthermalfe: -467.200032 hartree
dipole: 0.0000 0.3416 0.0001
dipole: 0.3416
quadrupole: -68.6794 -71.5384 -78.7180
quadrupole: 0.0000 0.0006 0.0006
quadrupole: 4.2992 1.4402 -5.7394 0.0000 0.0006 0.0006
hfenergy: -467.4237177 hartree
pointgroup: C01 [X(C12H18)]
dipole: -0.0000005 0.1343789 -0.0000539 debye
polarizability: 153.0763831|-0.0003912|135.4167938|0.0025442|-0.010263|92.3349687 unknown
InChI: InChI=1S/C12H18/c1-9(2)11-6-5-7-12(8-11)10(3)4/h5-10H,1-4H3
charge 0 multiplicity 1
30 atoms
C  -2.566218 0.44282 -0.000004
C  2.56629 0.442637 0.000333
C  -1.240113 -0.320851 0.000243
C  1.240136 -0.320937 0.000448
C  0.000034 0.367232 0.000115
C  -1.224795 -1.739099 0.000624
C  1.224714 -1.739187 0.000842
C  -2.730253 1.311416 -1.276999
C  -2.73021 1.312275 1.276409
C  2.73073 1.3108 -1.276908
C  2.730005 1.312516 1.2765
C  -0.000065 -2.444242 0.000902
H  -3.385161 -0.305504 0.000266
H  3.38518 -0.305743 0.001074
H  0.000076 1.465293 -0.000256
H  -2.173621 -2.290529 0.000689
H  2.173505 -2.290676 0.001085
H  -2.653533 0.695525 -2.191598
H  -3.715013 1.815763 -1.278996
H  -1.949584 2.093636 -1.33033
H  -2.653555 0.696982 2.191416
H  -3.714935 1.816689 1.278051
H  -1.949482 2.09447 1.329253
H  3.715481 1.815161 -1.278754
H  1.950057 2.092984 -1.33075
H  2.654296 0.694598 -2.191321
H  2.653121 0.697525 2.191693
H  3.714739 1.816911 1.278201
H  1.949277 2.094737 1.328894
H  -0.000104 -3.540698 0.001178
