program: Gaussian 09
title: 000063080
version: EM64L-G09RevD.01
frameworkgroup: C1[X(C12H4Cl6)]
method: RPBEPBE
basis: SDD
operation: Freq
keyword: #pfreq=noraman
keyword: PBEPBE/SDD
title: #p freq=noraman PBEPBE/SDD
converged: NO NO NO NO
title: Mulliken charges:
elementType: Cl Cl Cl Cl Cl Cl C C C C C C C C C C C C H H H H
charge: 0.034080 -0.002324 -0.022319 0.051726 0.021988 -0.032479 0.526581 0.393050 -0.249201 -0.306958 -0.263311 -0.310270 -0.084973 -0.232714 -0.100259 -0.195085 -0.218024 -0.103130 0.255717 0.289977 0.284330 0.263599
chargesum: 0.00000
title: Mulliken charges with hydrogens summed into heavy atoms:
elementType: Cl Cl Cl Cl Cl Cl C C C C C C C C C C C C
charge: 0.034080 -0.002324 -0.022319 0.051726 0.021988 -0.032479 0.526581 0.393050 -0.249201 -0.306958 -0.263311 -0.054553 -0.084973 0.057263 -0.100259 0.089245 0.045574 -0.103130
polarizability: 2.77837934e+02 -1.17251380e+00 1.60879016e+02 -1.16156963e+01 3.87269414e-02 1.25143618e+02
1716.lowfreq: -0.0016 0.0006 0.0011 3.8082 5.4949 8.4692 15.4044 33.6988 35.1778
frequency: 15.3943 33.6973 35.1696 70.4333 95.4869 126.8800 142.4590 157.1690 166.0465 184.1965 191.4774 206.4527 229.7456 270.9420 311.4085 328.3237 331.6709 350.6010 372.2619 418.7397 441.6069 451.6354 518.7185 523.2689 529.3675 570.4533 618.8660 622.9255 662.3720 728.7220 746.2068 749.2871 770.0165 821.2252 830.3975 861.5309 870.3023 955.4054 990.5914 1045.5207 1082.8828 1112.7514 1140.7404 1160.3128 1237.9252 1262.5999 1320.6989 1338.3451 1344.9435 1374.6116 1406.8104 1469.7758 1532.1171 1562.2457 1570.0075 1597.5615 3151.9418 3179.9368 3182.8350 3185.2791
redmass: 13.1387 23.6494 20.0864 31.3236 22.4310 7.5201 20.5512 10.1262 6.6219 25.3350 20.8900 32.5882 20.1964 7.4761 26.9864 9.6291 7.2806 31.9998 12.1665 8.1486 3.7568 8.1890 7.1766 9.9272 4.5790 4.9266 7.1403 9.7212 7.5887 4.3497 7.8008 10.3628 10.3909 1.6705 4.6085 1.4160 1.4144 1.3576 8.3270 3.9815 2.7590 3.4531 1.3795 2.1767 1.7649 2.1773 5.5005 11.4024 4.7820 4.6261 3.2162 3.3889 10.3222 8.4850 9.4417 7.8548 1.0899 1.0956 1.0945 1.0935
irintensity: 0.1379 0.0250 0.0270 0.0159 0.0709 0.8245 0.1560 0.1162 0.0001 0.4953 0.4522 0.0035 0.1074 1.5072 0.2258 0.1198 0.2435 0.0791 4.3577 18.7856 8.2711 3.1661 0.8454 16.2420 6.2112 3.9330 37.8039 3.1439 5.4559 4.3202 3.6250 110.2311 39.0016 21.9636 3.4400 19.2552 18.8201 0.1627 28.8222 30.2695 45.7304 10.2261 4.7304 30.1227 2.5013 10.6382 89.7068 5.5157 8.9638 13.4054 157.1101 26.3074 31.6705 27.5543 76.4311 28.2796 2.9464 0.4648 1.7935 2.7028
temp: 298.150 k
press: 1.00000 atm
elementType: 17 17 17 17 17 17 6 6 6 6 6 6 6 6 6 6 6 6 1 1 1 1
symmnumber: 1
zpe: 314386.4 jmol-1
zpe.correction: 0.119743 hartree
zpe.thermalcorrener: 0.136892 hartree
zpe.thermalcorrenthalpy: 0.137836 hartree
zpe.thermalcorrgfe: 0.071320 hartree
zpe.sumelectzpe: -3218.774986 hartree
zpe.sumelectthermal: -3218.757837 hartree
zpe.sumelectthermalent: -3218.756893 hartree
zpe.sumelectthermalfe: -3218.823409 hartree
dipole: 0.1347 0.9345 -1.5020
dipole: 1.7741
quadrupole: -149.4262 -145.2489 -139.4862
quadrupole: -3.9334 -0.8344 -0.2799
quadrupole: -4.7058 -0.5284 5.2342 -3.9334 -0.8344 -0.2799
hfenergy: -3218.894729 hartree
pointgroup: C01 [X(C12H4Cl6)]
dipole: -0.0455311 -0.3712671 -0.5893006 debye
dipolederiv: -0.2049466 0.2296255 0.004417 0.2366779 -0.5436851 -0.007171 -0.0033514 -0.0067331 -0.0034828 -0.3191579 -0.2739335 -0.006076 -0.2864729 -0.5787867 -0.0167638 -0.0147627 -0.0154342 -0.0274225 -0.2739479 0.0214043 -0.2226003 0.0231345 -0.0399265 0.0275999 -0.2482876 0.0328833 -0.6006765 -0.2929151 -0.2992243 -0.0034948 -0.3773681 -0.421335 -0.0074154 -0.0102692 -0.0105696 0.0114697 -0.7983279 0.0944178 0.0003153 0.1160281 -0.0767394 -0.0008853 -0.0063277 -0.000248 -0.0147973 -0.928458 0.0629565 -0.0611846 0.0727585 -0.0579591 0.0062794 -0.0252602 0.0030425 -0.1237964 0.2673456 -0.0728949 -0.0480889 -0.0161716 -0.3904294 -0.0054464 -0.049126 -0.0060665 0.0047429 0.172763 -0.0001433 -0.1016171 -0.0093593 -0.0045538 0.0116431 -0.0833412 0.0125723 -0.2457383 0.2022903 -0.3656934 0.0002271 -0.3950405 0.7206788 0.0072629 -0.0030246 0.0214329 -0.0086418 0.4180488 0.4197159 0.0178431 0.3233671 0.8974549 0.0287558 0.0121898 0.012401 -0.0507501 0.3534573 -0.0404905 0.3999858 -0.0395636 -0.0226459 -0.0445707 0.2237251 -0.0444052 0.9146761 0.0066956 -0.0130876 0.0228843 -0.0130647 -0.0773584 -0.007155 0.1500776 -0.0105252 0.1003583 0.0232532 0.6200848 0.0123306 0.6750263 0.4369708 0.0114038 0.0195382 0.0136211 -0.042963 -0.4684048 -0.0960017 -0.001731 -0.0861137 -0.2371318 -0.0100643 0.0022449 -0.0057523 -0.0539148 1.1495936 -0.2692816 0.0050452 -0.2078752 0.1126776 0.0039612 0.008728 -0.0004573 -0.0342378 -0.4973909 0.0348494 -0.2053706 0.0397529 -0.0627448 0.0186841 -0.1406527 0.0164861 -0.2445305 -0.4240842 0.020569 0.0763667 0.026694 -0.1045593 -0.006544 0.0610686 -0.0052114 -0.0405449 1.399771 -0.1097968 0.0656023 -0.121662 -0.0494954 -0.0102898 0.0505166 -0.0097262 0.2439701 0.0428718 0.0080194 0.0679371 0.0045361 0.1284636 -0.0027225 0.0827692 -0.0019761 -0.0067271 0.0655629 0.0128776 0.0007704 0.0158099 0.0476974 -0.0027369 -0.0031501 -0.0011282 0.1660456 0.0643598 0.006586 0.0332597 0.0079796 0.1620988 -0.0009249 0.0303094 -0.0007824 0.0480422 0.0416205 0.0094414 -0.0568214 0.0109264 0.1613088 0.0071 -0.0536138 0.0065766 0.0089186 unknown
polarizability: 277.9580488|2.6617231|160.9278763|10.4436448|0.1915095|124.9746433 unknown
InChI: InChI=1S/C12H4Cl6/c13-5-1-2-6(7(14)3-5)10-8(15)4-9(16)11(17)12(10)18/h1-4H
charge 0 multiplicity 1
22 atoms
Cl 0.567294 2.588835 -0.067582
Cl 0.141187 -2.962081 -0.186633
Cl -0.953425 -0.108007 2.640875
Cl 3.783554 2.325753 -0.036407
Cl 5.131661 -0.634697 -0.075748
Cl -5.619559 0.324386 -0.311094
C  0.497523 -0.188185 -0.130157
C  -0.994382 -0.0607 -0.161036
C  1.338731 0.955159 -0.096105
C  1.140746 -1.450326 -0.147384
C  -1.77187 -0.016083 1.020935
C  -1.678939 0.01525 -1.400349
C  2.751047 0.852393 -0.078847
C  2.53931 -1.592115 -0.129798
C  3.337514 -0.434054 -0.095943
C  -3.175134 0.100447 0.996844
C  -3.083111 0.13247 -1.463805
C  -3.809964 0.173296 -0.257651
H  -1.098695 -0.016555 -2.328204
H  3.002737 -2.581219 -0.140746
H  -3.749935 0.133299 1.925545
H  -3.597891 0.190834 -2.42641
