program: Gaussian 09
title: 000063079
version: EM64L-G09RevD.01
frameworkgroup: C1[X(C12H4Cl6)]
method: RPBEPBE
basis: SDD
operation: Freq
keyword: #pfreq=noraman
keyword: PBEPBE/SDD
title: #p freq=noraman PBEPBE/SDD
converged: NO NO NO NO
title: Mulliken charges:
elementType: Cl Cl Cl Cl Cl Cl C C C C C C C C C C C C H H H H
charge: 0.038662 0.038682 0.018025 0.018005 -0.002908 0.004684 0.550473 0.301970 -0.317627 -0.317622 -0.313003 -0.342169 -0.088191 -0.088156 -0.225454 -0.055901 -0.183287 -0.114025 0.272804 0.253839 0.289390 0.261808
chargesum: 0.00000
title: Mulliken charges with hydrogens summed into heavy atoms:
elementType: Cl Cl Cl Cl Cl Cl C C C C C C C C C C C C
charge: 0.038662 0.038682 0.018025 0.018005 -0.002908 0.004684 0.550473 0.301970 -0.317627 -0.317622 -0.040198 -0.088330 -0.088191 -0.088156 0.063936 -0.055901 0.078521 -0.114025
polarizability: 2.60502933e+02 -5.24601672e-03 1.81450072e+02 2.55311268e+00 5.38648392e-02 1.24355475e+02
1716.lowfreq: -6.1494 0.0009 0.0019 0.0023 2.4619 4.8452 5.1375 34.3968 38.7413
frequency: -3.4701 34.3826 38.7400 64.3080 98.9580 115.9472 144.9457 161.2079 183.6802 185.2466 188.0420 199.4739 247.3989 281.3556 303.0257 325.0950 329.1743 329.5743 369.0838 423.5246 436.7192 461.6898 507.7008 524.8277 572.9165 573.4090 593.6471 653.7036 656.4880 702.3319 716.1034 753.4526 814.7572 824.3534 841.2642 865.7536 892.5981 957.0218 1001.6789 1022.8167 1115.2739 1123.0719 1147.9012 1158.7427 1229.3713 1253.4528 1330.2771 1342.2784 1364.9612 1373.1051 1378.6191 1463.0843 1543.7505 1553.3891 1556.5907 1595.9967 3150.4366 3159.6601 3170.7539 3176.4302
redmass: 12.3252 23.6008 18.8539 34.2530 15.0552 6.9402 18.5046 10.6258 31.1232 7.3170 28.5988 31.5320 19.3277 7.9451 21.0349 7.2747 28.4873 12.7439 7.0362 7.5706 3.2276 13.3427 6.6443 9.9026 7.1330 4.7203 12.0679 7.8167 7.2581 8.9092 3.6223 8.1321 9.9022 1.4219 8.5124 1.4246 1.4539 1.3513 7.0949 6.1508 2.6495 4.3284 1.4527 1.5577 3.7678 1.5324 11.8681 4.8542 4.7089 3.2532 4.7295 3.2057 7.9201 11.1821 8.0715 6.8217 1.0887 1.0928 1.0977 1.0932
irintensity: 0.1554 0.0019 0.0314 0.0000 0.2698 0.5983 0.1629 0.1869 0.0381 0.0004 0.0155 0.0205 0.4185 1.4786 0.0463 1.7759 0.0102 0.0496 5.6407 0.3309 6.4610 34.0940 2.0505 0.3391 14.4675 4.7770 0.0027 53.7930 8.1108 12.2567 28.0814 4.4940 2.9543 15.2696 37.9472 19.6266 5.2951 0.7480 23.6185 101.9860 16.8965 39.9016 0.3335 46.0635 11.3591 10.5267 1.1549 5.7175 44.8543 150.2558 32.3128 61.2553 12.5006 6.2470 16.6124 3.9978 2.0509 0.2133 2.1157 2.3505
temp: 298.150 k
press: 1.00000 atm
elementType: 17 17 17 17 17 17 6 6 6 6 6 6 6 6 6 6 6 6 1 1 1 1
symmnumber: 1
zpe: 314519.4 jmol-1
zpe.correction: 0.119794 hartree
zpe.thermalcorrener: 0.135994 hartree
zpe.thermalcorrenthalpy: 0.136938 hartree
zpe.thermalcorrgfe: 0.073806 hartree
zpe.sumelectzpe: -3218.772212 hartree
zpe.sumelectthermal: -3218.756013 hartree
zpe.sumelectthermalent: -3218.755068 hartree
zpe.sumelectthermalfe: -3218.818201 hartree
dipole: 2.0354 -0.0024 -1.2551
dipole: 2.3913
quadrupole: -148.3442 -150.8395 -138.3723
quadrupole: 0.0110 4.4308 0.0235
quadrupole: -2.4922 -4.9875 7.4797 0.0110 4.4308 0.0235
hfenergy: -3218.8920061 hartree
pointgroup: C01 [X(C12H4Cl6)]
dipole: -0.7863406 0.0002686 -0.5164929 debye
dipolederiv: -0.2228398 -0.2731415 0.0156797 -0.2464129 -0.5373198 0.0220648 0.0182464 0.0234828 -0.0040526 -0.2228476 0.2732048 0.0150548 0.2464366 -0.5374313 -0.0208609 0.0172068 -0.0218639 -0.0039165 -0.3317949 -0.3269225 0.0185586 -0.3691365 -0.532148 0.0224366 0.0255082 0.0261599 -0.0151177 -0.3317945 0.3269949 0.0177569 0.3691731 -0.5323109 -0.021235 0.024278 -0.0245575 -0.0149946 -0.307568 0.0001581 -0.2769776 0.0002264 -0.0274734 0.0002693 -0.3781912 0.0002608 -0.5283628 -0.8221896 0.0000451 0.0963608 0.0000569 -0.0244399 0.0000114 0.1040493 0.0000029 -0.070946 0.3349582 -0.0000296 -0.0093303 -0.0000056 -0.245793 0.0005287 -0.0382809 0.0006154 -0.0174664 0.2388889 -0.0000371 -0.0149906 -0.0000445 -0.0281357 -0.0000683 0.0206765 0.0000016 0.0797093 0.0890577 0.4708416 -0.0171448 0.5132632 0.6299818 -0.0473262 -0.011068 -0.0369041 -0.0465067 0.0890739 -0.4709099 -0.0160016 -0.5132702 0.6302124 0.0457683 -0.0089793 0.0347172 -0.0467622 -0.2372617 0.0000862 -0.1692163 -0.0000584 -0.0447328 0.0000369 0.0232628 0.0000241 -0.1323327 -0.1357525 0.0000019 0.0614862 0.0001382 -0.0946562 -0.0001403 -0.09398 -0.0000513 0.0434753 0.4050558 0.516364 -0.0284494 0.6580897 0.681 -0.0446944 -0.0365999 -0.0412267 -0.0432961 0.4050399 -0.5164375 -0.0271171 -0.6581555 0.6812712 0.0428755 -0.0344671 0.0391474 -0.0435383 -0.205873 0.0000253 0.0068877 0.0000206 -0.3517793 0.000479 0.0121261 0.0004845 -0.0460142 0.1722218 -0.0002741 0.576485 -0.0002575 -0.0309239 -0.0004543 0.5495895 -0.0004593 0.7644966 -0.2492086 -0.0000125 0.0107141 0.0000069 -0.0773567 -0.0000673 -0.0349416 -0.0001033 0.0166806 1.1370223 0.0000129 -0.2872832 -0.0000587 -0.0576471 0.0000407 -0.189817 0.0000799 -0.0807248 0.0823055 -0.0000292 0.0502549 -0.0000211 0.1320252 0.0000683 0.0656356 0.0000348 0.0206361 0.0387189 0.0000521 -0.0796501 0.0000443 0.1317125 0.0001009 -0.0888579 0.0000553 0.0075955 0.0384637 0.0000055 0.0102499 0.0000078 0.0805298 0.000068 0.0099046 0.0000263 0.1666743 0.0363236 0.0000015 0.0466723 -0.0000427 0.1554149 0.0000983 0.0446993 0.0000734 -0.0052362 unknown
polarizability: 260.5374892|-0.0242468|181.4497243|1.3458565|-0.152625|124.3212658 unknown
InChI: InChI=1S/C12H4Cl6/c13-6-2-1-5(3-7(6)14)10-11(17)8(15)4-9(16)12(10)18/h1-4H
charge 0 multiplicity 1
22 atoms
Cl -0.607456 2.782592 -0.106979
Cl -0.607614 -2.782588 -0.100675
Cl -3.853821 -2.750381 0.15555
Cl -3.853649 2.751163 0.149424
Cl 3.91584 -0.001932 2.352922
Cl 5.341756 -0.000517 -0.609263
C  -0.775232 0.0000 -0.091575
C  0.721446 -0.00018 -0.21462
C  -1.502903 1.219583 -0.034537
C  -1.503053 -1.219402 -0.032611
C  1.526846 -0.000941 0.948101
C  1.340979 0.000422 -1.489561
C  -2.913547 -1.216607 0.079031
C  -2.913383 1.217134 0.077185
C  -3.617696 0.000356 0.134007
C  2.932252 -0.001062 0.840073
C  2.746384 0.000271 -1.596058
C  3.546334 -0.000412 -0.433611
H  1.068989 -0.001401 1.94236
H  0.731364 0.000986 -2.398733
H  -4.707633 0.000484 0.220491
H  3.229397 0.000732 -2.578021
