program: Gaussian 09
title: 000007448
version: EM64L-G09RevD.01
frameworkgroup: C1[X(C7H4ClNO4)]
method: RPBEPBE
basis: SDD
operation: Freq
keyword: #p
keyword: freq=noraman
keyword: PBEPBE/SDD
title: #p freq=noraman PBEPBE/SDD
converged: YES YES NO NO
title: Mulliken charges:
elementType: Cl O O O O N C C C C C C C H H H H
charge: 0.040497 -0.445608 -0.204515 -0.190808 -0.190332 0.027798 0.378677 0.417386 -0.283634 -0.273484 -0.346881 -0.363430 0.125835 0.299308 0.316585 0.295997 0.396610
chargesum: 0.00000
title: Mulliken charges with hydrogens summed into heavy atoms:
elementType: Cl O O O O N C C C C C C C
charge: 0.040497 -0.048998 -0.204515 -0.190808 -0.190332 0.027798 0.378677 0.417386 -0.283634 0.025824 -0.030296 -0.067433 0.125835
polarizability: 1.63691815e+02 5.12191056e+00 1.28370054e+02 6.96136408e-02 5.08831183e-02 3.97624429e+01
1716.lowfreq: -7.0838 -3.5754 -0.0003 0.0012 0.0025 8.6685 13.6711 52.0356 76.5553
frequency: 13.4330 52.0329 76.5492 157.4222 162.5537 193.8236 257.0806 288.2785 305.3061 355.9445 433.7828 475.5277 509.8687 511.2143 544.9115 587.9610 630.1378 665.6580 673.1948 702.0872 733.6798 766.8541 841.0510 870.8883 926.1743 994.9683 1006.1423 1045.4868 1102.4306 1138.9929 1153.5859 1210.9307 1253.8288 1309.1761 1364.3637 1386.4216 1399.1494 1458.6873 1581.0872 1600.2268 1653.5007 3184.4396 3188.8796 3200.9753 3536.0254
redmass: 13.5852 15.7435 7.1837 11.6175 5.6815 15.7104 6.4100 12.8179 8.7606 18.3368 3.1428 7.9356 6.0967 7.5324 5.4586 1.3142 6.1055 3.9221 6.4260 4.7064 9.1032 4.7800 9.3000 1.4860 1.4588 5.7339 1.3639 2.5148 3.6382 1.3587 1.9767 9.2656 1.4467 2.3204 4.5914 9.3813 7.7832 2.6617 9.2503 7.0155 9.3696 1.0893 1.0928 1.0971 1.0644
irintensity: 1.0018 0.0000 1.8193 2.3946 0.3023 0.9194 4.7772 0.2698 2.0591 0.8122 13.5111 23.1691 3.9410 12.5572 6.7923 99.2795 14.8874 55.5779 19.2302 43.6722 49.9219 4.7637 33.3294 24.5077 29.3254 242.7203 0.0729 41.9554 49.6486 23.7646 102.3430 233.8916 8.0373 67.6521 8.7045 38.3777 129.6104 42.5830 12.8045 3.7685 238.4340 2.9066 9.5813 1.2770 63.2550
temp: 298.150 k
press: 1.00000 atm
elementType: 17 8 8 8 8 7 6 6 6 6 6 6 6 1 1 1 1
symmnumber: 1
zpe: 272178.6 jmol-1
zpe.correction: 0.103667 hartree
zpe.thermalcorrener: 0.114963 hartree
zpe.thermalcorrenthalpy: 0.115907 hartree
zpe.thermalcorrgfe: 0.063792 hartree
zpe.sumelectzpe: -1083.841517 hartree
zpe.sumelectthermal: -1083.830221 hartree
zpe.sumelectthermalent: -1083.829277 hartree
zpe.sumelectthermalfe: -1083.881392 hartree
dipole: 2.6719 -2.7611 -0.0218
dipole: 3.8423
quadrupole: -97.0683 -75.8309 -79.8578
quadrupole: -8.3972 -0.1321 -0.0810
quadrupole: -12.8159 8.4214 4.3945 -8.3972 -0.1321 -0.0810
hfenergy: -1083.9451839 hartree
pointgroup: C01 [X(C7H4Cl1N1O4)]
dipole: -1.1273176 -1.0039179 0.0802927 debye
dipolederiv: -0.1395676 0.235285 -0.001997 0.2564254 -0.5814344 0.0092397 -0.0027187 0.0086677 -0.0076796 -0.5985454 -0.4309753 0.0282315 -0.5261197 -1.0851328 0.052275 0.0361 0.0487666 -0.4341553 -0.9329686 0.2009041 0.0058005 0.0619936 -0.6319684 0.019149 0.0168876 0.0144472 -0.301378 -0.7260759 0.2139391 0.0099792 0.1355361 -0.6378077 0.009478 0.0127877 0.006731 -0.2163188 -0.69856 -0.1638514 0.0215609 -0.1443673 -0.6465709 0.0190316 0.021005 0.0197417 -0.216441 1.737386 -0.0408181 -0.0502514 0.0393474 1.0723896 -0.0306447 -0.0535208 -0.0276863 0.1933256 -0.5854192 -0.0731478 0.0237174 0.0253276 -0.1796176 0.0085516 0.0195227 0.0114766 0.0647475 -0.5155704 0.0061248 0.0194639 -0.0305609 0.2659592 -0.0047277 0.0210789 -0.0057858 0.0788885 0.2993468 -0.6362046 0.0071818 -0.3287588 0.9064817 -0.0179007 -0.0045775 -0.0080802 -0.0611754 0.0240285 0.1832512 -0.0102775 -0.0154026 -0.0195689 -0.0017911 -0.0006069 -0.0085893 -0.0917184 -0.1266936 0.3581724 -0.0088012 -0.0293644 -0.2754732 0.0076527 0.0037993 -0.0054949 -0.0606272 -0.0555897 -0.2362693 0.0056363 0.0837245 -0.1325084 -0.0024548 -0.0045156 0.0080641 -0.1179904 1.7756605 0.3014456 -0.0571755 0.3263074 1.3932508 -0.07696 -0.0651831 -0.0722237 0.2484755 0.1157149 -0.0158799 0.0018285 -0.0313459 0.0425661 0.0046035 0.0011172 0.0045938 0.159734 0.1369994 -0.0286431 0.0022152 -0.0040852 0.0973682 0.0026709 0.0015146 0.0032789 0.1770283 0.1051464 0.0499048 0.0007334 0.0242801 0.0813986 0.0022987 0.0013199 0.0012749 0.1771505 0.1847079 0.0767625 0.0021539 0.1570627 0.3306681 -0.0004717 -0.0040102 0.0008179 0.4081342 unknown
polarizability: 162.6184033|-7.7866285|129.2217954|-3.7541437|-2.8476803|39.9841131 unknown
InChI: InChI=1S/C7H4ClNO4/c8-6-3-4(9(12)13)1-2-5(6)7(10)11/h1-3,10H
charge 0 multiplicity 1
17 atoms
Cl -1.439822 2.657467 -0.00906
O  -3.19468 -1.635216 0.208928
O  -3.617059 0.640659 0.098659
O  3.650222 -1.17154 -0.057136
O  3.571102 1.108114 -0.129854
N  3.011836 -0.051712 -0.072679
C  -1.293281 -0.185928 0.074945
C  1.522898 -0.106053 -0.020855
C  -0.600568 1.057373 0.012033
C  -0.520225 -1.382915 0.088896
C  0.806495 1.104591 -0.036055
C  0.882482 -1.360907 0.041398
C  -2.786056 -0.291346 0.124861
H  -1.056274 -2.332801 0.138258
H  1.343313 2.054988 -0.084386
H  1.477034 -2.277037 0.051532
H  -4.188317 -1.663139 0.238416
