program: Gaussian 09
title: 000063064
version: EM64L-G09RevD.01
frameworkgroup: C1[X(C24H24O2)]
method: RPBEPBE
basis: SDD
operation: Freq
keyword: #pfreq=noraman
keyword: PBEPBE/SDD
title: #p freq=noraman PBEPBE/SDD
converged: YES YES NO NO
title: Mulliken charges:
elementType: O O C C C C C C C C C C C C C C C C C C C C C C C C H H H H H H H H H H H H H H H H H H H H H H H H
charge: -0.294715 -0.442080 0.173153 0.094354 -0.558764 0.286932 0.323783 0.281756 -0.380875 -0.399108 -0.688727 -0.418736 -0.386796 -0.401087 -0.403240 -0.394600 -0.356566 0.344924 -0.241388 -0.230176 -0.230959 -0.232594 -0.248831 -0.251301 -0.274920 -0.337745 0.254325 0.212464 0.246735 0.253249 0.210378 0.217169 0.238031 0.227747 0.253617 0.254938 0.250244 0.248279 0.244107 0.223001 0.225511 0.224788 0.223915 0.226910 0.226370 0.205157 0.227702 0.213673 0.205992 0.354004
chargesum: 0.00000
title: Mulliken charges with hydrogens summed into heavy atoms:
elementType: O O C C C C C C C C C C C C C C C C C C C C C C C C
charge: -0.294715 -0.088075 0.173153 0.094354 -0.091974 0.286932 0.323783 0.281756 -0.134141 -0.145859 -0.023148 -0.190989 -0.133180 -0.146149 -0.152996 -0.146322 -0.112459 0.344924 -0.018387 -0.004665 -0.006170 -0.008679 -0.021921 -0.024931 0.157938 0.081920
polarizability: 4.01054760e+02 9.54558233e+00 2.62770678e+02 7.25692991e+00 5.26763486e+00 1.91616207e+02
1716.lowfreq: -5.4489 -4.5223 -2.8426 -0.0006 -0.0005 0.0005 22.0779 27.8077 34.3685
frequency: 22.0488 27.7424 34.2610 48.9564 51.1995 56.3022 64.6573 71.8470 79.8708 100.8224 114.0154 133.6152 152.7380 176.2748 184.9349 198.1458 220.5996 247.0492 254.8514 300.6136 305.9830 318.9037 366.5180 403.2559 405.6301 413.5731 416.5338 434.3521 442.2023 447.1479 483.1368 502.1609 521.6782 564.4697 596.8987 614.1219 616.1328 620.8034 633.1455 665.8834 683.8354 702.1703 703.9067 732.5378 752.5263 771.4823 774.9429 781.0334 817.5320 822.8310 846.4191 852.4887 852.9404 875.6470 882.4166 893.2431 918.8159 924.6100 947.3508 958.6861 969.1115 976.7355 977.7706 988.1751 989.1990 992.1488 993.7190 993.9031 1003.6091 1024.6120 1027.0377 1046.3712 1050.0244 1058.7644 1081.5589 1088.0703 1089.5960 1104.1790 1116.1513 1170.7991 1171.4956 1176.8762 1181.9047 1189.5552 1190.2909 1192.4008 1217.3502 1225.9613 1246.5594 1267.7633 1290.6412 1303.9924 1312.8265 1318.9110 1322.9273 1332.5281 1353.2287 1368.1970 1368.9195 1373.4337 1384.4145 1387.3186 1415.9566 1430.8166 1432.7020 1454.7059 1459.7574 1471.4708 1472.1874 1477.3825 1480.1334 1486.3838 1495.7656 1569.0879 1573.5615 1579.6483 1592.7154 1605.5547 1606.1819 1615.6761 2964.9681 2967.8465 2974.7069 2980.7242 3036.4199 3059.6898 3074.5469 3082.3875 3087.3029 3118.3501 3120.4221 3126.3536 3128.0254 3137.2618 3139.0555 3140.8913 3141.2369 3150.4823 3150.8248 3162.6846 3163.8138 3163.9506 3166.6432 3554.9252
redmass: 5.2735 5.4812 3.6554 3.9336 4.3704 4.6068 4.4799 4.5303 3.8546 3.0438 3.5415 4.3515 3.2004 4.7149 1.2832 3.7969 3.4123 4.7128 3.7044 3.1216 3.5327 3.2084 3.7808 2.8498 2.8484 2.2791 2.5169 3.4787 1.6564 4.1342 3.5176 3.4546 3.0226 3.8638 3.8272 6.2388 6.0813 4.9033 6.3089 4.8129 4.6513 1.6931 1.6379 3.3309 3.0247 1.5306 2.6084 2.2139 1.5113 1.6497 1.7469 1.2817 1.2539 2.9769 3.6731 2.5571 1.4475 1.4405 1.4982 2.1655 1.3872 1.3908 1.3993 5.7124 5.4964 2.6086 1.3203 1.3379 2.7346 2.5659 2.1480 2.4372 3.0929 1.7612 1.6160 1.6673 1.7404 1.9218 1.3424 1.0606 1.0726 1.6068 2.0431 1.1393 1.1827 1.1319 1.3321 2.1733 1.5886 2.4811 2.3394 1.4128 1.3922 1.4582 1.4939 1.1966 3.0719 1.6368 6.4011 5.3835 1.3066 1.2043 3.7286 2.3242 2.2908 1.1132 1.0869 1.0470 1.1616 1.9877 2.0849 1.0972 2.4965 7.2635 6.3405 5.8745 8.0395 6.0588 6.0818 6.3412 1.0554 1.0677 1.0686 1.0352 1.1060 1.0917 1.1001 1.0970 1.0990 1.0850 1.0844 1.0870 1.0875 1.0885 1.0926 1.0927 1.0874 1.0955 1.0958 1.0951 1.1012 1.1011 1.0962 1.0655
irintensity: 0.1850 0.3834 1.1304 0.1125 0.7589 0.1299 0.1899 0.2695 2.3943 0.1052 2.0571 1.0360 2.7970 2.6753 0.4407 0.2761 4.1768 0.5064 0.9514 1.5619 1.1815 0.3933 0.7084 0.2180 0.0584 63.0406 38.8375 4.4582 131.9480 1.2541 5.3685 9.2124 9.8737 5.2046 24.4325 0.5335 1.7605 8.9726 4.1481 5.3932 2.8351 67.2576 29.4285 4.6725 26.8539 66.7447 12.1101 12.9064 29.2731 11.4640 27.5382 0.9837 0.4112 24.6353 4.1113 45.9414 5.7901 1.7087 2.8118 3.9409 2.3274 0.1586 0.3207 1.3583 1.3446 116.2312 0.4112 0.7926 7.6076 10.2975 7.7186 4.0875 47.5862 2.5017 0.7091 12.4247 14.4569 10.4391 9.1371 0.0422 1.2894 123.0822 44.5079 3.5260 10.7572 0.5517 86.3759 184.2087 1.5416 26.4680 3.9222 2.5656 0.2821 0.7443 6.5880 16.3866 5.2441 15.7210 3.3542 4.0384 26.8222 14.4550 3.5090 2.0226 12.5430 55.1003 7.2252 6.3291 5.7907 8.2010 9.0012 10.6742 153.5274 9.4410 3.1779 3.0211 1.4842 16.4251 11.6248 73.5588 37.3538 23.3356 53.1725 39.9214 47.8056 4.4428 44.9699 33.3614 47.0224 5.5331 2.3870 0.3501 1.7735 10.0878 25.5707 23.8605 9.3879 39.8268 31.3877 17.0583 30.5895 15.9419 6.3903 6.6525
temp: 298.150 k
press: 1.00000 atm
elementType: 8 8 6 6 6 6 6 6 6 6 6 6 6 6 6 6 6 6 6 6 6 6 6 6 6 6 1 1 1 1 1 1 1 1 1 1 1 1 1 1 1 1 1 1 1 1 1 1 1 1
symmnumber: 1
zpe: 1075088.3 jmol-1
zpe.correction: 0.409480 hartree
zpe.thermalcorrener: 0.433646 hartree
zpe.thermalcorrenthalpy: 0.434590 hartree
zpe.thermalcorrgfe: 0.353320 hartree
zpe.sumelectzpe: -1077.519292 hartree
zpe.sumelectthermal: -1077.495126 hartree
zpe.sumelectthermalent: -1077.494182 hartree
zpe.sumelectthermalfe: -1077.575452 hartree
dipole: -1.2291 -0.1511 -1.7931
dipole: 2.1791
quadrupole: -160.5400 -147.4977 -146.5802
quadrupole: -2.4459 -10.7984 0.0973
quadrupole: -9.0007 4.0416 4.9591 -2.4459 -10.7984 0.0973
hfenergy: -1077.9287719 hartree
pointgroup: C01 [X(C24H24O2)]
dipole: -0.4563278 -0.1578054 -0.7084464 debye
polarizability: 398.628336|19.2962272|265.0952951|11.6594688|-0.6087205|191.7180134 unknown
InChI: InChI=1S/C24H24O2/c1-2-23(19-9-5-3-6-10-19)24(20-11-7-4-8-12-20)21-13-15-22(16-14-21)26-18-17-25/h3-16,25H,2,17-18H2,1H3
charge 0 multiplicity 1
50 atoms
O  5.171497 -0.427711 0.264425
O  7.663609 0.591287 1.240372
C  -1.36239 -1.362297 -0.19855
C  -0.570576 -0.226042 -0.14242
C  -0.786714 -2.762421 -0.409039
C  0.926107 -0.28709 -0.062702
C  -2.854192 -1.312699 -0.046978
C  -1.141695 1.16326 -0.212702
C  1.598947 -1.098244 0.896714
C  1.72806 0.514162 -0.918066
C  -1.031775 -3.735506 0.77367
C  -3.713621 -2.03263 -0.923486
C  -3.450926 -0.597521 1.029728
C  -2.124598 1.512566 -1.179622
C  -0.664713 2.18351 0.656978
C  3.001875 -1.124224 0.983739
C  3.137682 0.494337 -0.853491
C  3.777581 -0.330842 0.103851
C  -5.1149 -2.014888 -0.749686
C  -4.849322 -0.586436 1.211746
C  -2.630179 2.827276 -1.258481
C  -1.175885 3.497521 0.586106
C  -5.69161 -1.291325 0.319759
C  -2.163455 3.826356 -0.371995
C  6.0326 0.394209 -0.608774
C  7.460023 0.127923 -0.133135
H  0.291807 -2.701947 -0.629782
H  -1.262748 -3.200113 -1.311227
H  1.0096 -1.697604 1.598628
H  1.238317 1.162739 -1.652648
H  -0.543792 -3.374687 1.697552
H  -0.626476 -4.737696 0.542664
H  -2.110549 -3.841391 0.985072
H  -3.28699 -2.595893 -1.761708
H  -2.805841 -0.052678 1.726931
H  -2.485982 0.74626 -1.873249
H  0.108323 1.938672 1.394449
H  3.513248 -1.743369 1.727392
H  3.715483 1.118616 -1.54139
H  -5.755764 -2.565859 -1.447718
H  -5.28236 -0.029837 2.050708
H  -3.385269 3.073787 -2.013637
H  -0.802707 4.264274 1.274766
H  -6.778485 -1.281176 0.458946
H  -2.55745 4.847238 -0.432288
H  5.897241 0.097066 -1.669117
H  5.776378 1.465145 -0.484383
H  8.173808 0.699613 -0.749835
H  7.686151 -0.954481 -0.229666
H  6.961628 0.171191 1.801182
