program: Gaussian 09
title: 000063060
version: EM64L-G09RevD.01
frameworkgroup: C1[X(C26H29NO2)]
method: RPBEPBE
basis: SDD
operation: Freq
keyword: #p
keyword: freq=noraman
keyword: PBEPBE/SDD
title: #p freq=noraman PBEPBE/SDD
converged: YES YES NO NO
title: Mulliken charges:
elementType: O O N C C C C C C C C C C C C C C C C C C C C C C C C C C H H H H H H H H H H H H H H H H H H H H H H H H H H H H H
charge: -0.277626 -0.453704 0.021010 -0.362216 -0.308852 0.095205 0.174816 -0.572165 -0.566613 0.285735 -0.557059 0.280731 0.323692 0.344880 -0.374640 -0.408117 -0.385563 -0.373225 -0.689108 -0.401626 -0.403854 -0.419081 -0.387739 -0.231134 -0.232114 -0.241831 -0.230370 -0.251595 -0.249585 0.219426 0.252839 0.203262 0.272601 0.261727 0.202395 0.252723 0.251958 0.203498 0.266330 0.211308 0.253974 0.254416 0.242508 0.246818 0.257203 0.211403 0.215391 0.237569 0.254728 0.251439 0.227214 0.254521 0.224006 0.223405 0.222212 0.225099 0.225528 0.226249
chargesum: 0.00000
title: Mulliken charges with hydrogens summed into heavy atoms:
elementType: O O N C C C C C C C C C C C C C C C C C C C C C C C C C C
charge: -0.277626 -0.453704 0.021010 0.110049 0.167011 0.095205 0.174816 0.144680 0.155173 0.285735 -0.091777 0.280731 0.323692 0.344880 -0.120224 -0.165609 -0.138745 -0.116023 -0.024745 -0.146899 -0.152415 -0.191868 -0.133218 -0.007128 -0.008708 -0.019620 -0.005271 -0.026067 -0.023336
polarizability: 4.49373141e+02 1.73507650e+01 2.95710752e+02 -7.10076398e-01 8.31227980e+00 2.17957065e+02
1716.lowfreq: -2.8319 -0.1033 -0.0011 0.0003 0.0012 5.2346 16.3829 24.3029 28.5184
frequency: 16.3316 24.2779 28.4240 40.8948 46.1041 51.3486 56.0371 62.1461 69.9798 78.5945 98.8572 102.7279 140.8328 141.3130 160.4531 175.1504 194.9001 203.9103 208.0418 223.4233 248.6708 254.0233 276.3567 287.6789 311.2886 318.7778 338.3827 357.3169 369.0938 403.5192 406.3353 408.2878 417.5880 434.5693 443.1338 456.8678 485.4237 502.3147 520.5801 537.2866 558.9102 596.6295 612.4536 614.8807 618.0716 634.2570 659.7157 685.1404 701.5738 704.9209 725.0888 737.2003 760.3027 769.8714 780.5340 799.2320 811.4207 826.1563 829.7716 844.2851 848.9773 851.3284 855.1837 880.2521 883.3447 891.1381 917.5470 925.7401 946.5108 960.3076 968.7604 975.1760 979.1786 980.7092 988.0119 989.0309 992.2803 994.4187 1004.1425 1024.3919 1027.2355 1045.5126 1049.1662 1058.9081 1081.5241 1086.1169 1087.8566 1102.4332 1106.7739 1117.2948 1138.8423 1160.5100 1170.6780 1171.1142 1177.1852 1183.1672 1189.6509 1191.8014 1211.4610 1220.4585 1227.5397 1245.5568 1266.9747 1283.2179 1288.3595 1306.0274 1311.9452 1312.6735 1318.2324 1322.8209 1356.9445 1368.9959 1373.2985 1381.8086 1386.5580 1395.6401 1416.2463 1417.5411 1430.7474 1432.2732 1432.5868 1452.9163 1455.2120 1460.7503 1468.9885 1473.1816 1475.6477 1477.5013 1480.1472 1485.8245 1488.2215 1498.3200 1569.3114 1573.1263 1579.6083 1591.5800 1605.6244 1606.3183 1615.6502 2965.7199 2979.3114 2983.3109 2989.9706 2997.1556 3018.2262 3058.5392 3072.6076 3076.2625 3086.6599 3105.1692 3114.5909 3118.1234 3120.2324 3122.2247 3126.4410 3127.9311 3138.3267 3138.8209 3140.6079 3140.8214 3149.4497 3150.2484 3150.8649 3156.8244 3163.2846 3163.3492 3163.4412 3167.3266
redmass: 4.9657 4.8734 3.7173 4.1317 4.1690 4.0207 4.2314 4.6532 3.7978 4.2029 3.1873 3.7083 3.7804 2.0089 4.6725 4.6743 1.7662 2.5565 2.5508 1.0565 3.7951 3.5640 1.3915 4.0598 3.5551 3.1543 2.8335 3.4379 3.5067 2.8476 2.8525 2.8084 2.9980 3.4868 4.1860 3.6484 3.7458 3.4465 3.1329 3.8684 4.0644 4.0844 5.4038 6.0436 5.8628 6.1203 5.0656 4.6899 1.6530 1.6657 4.0674 3.6935 2.5183 1.5388 2.1762 2.8610 1.5512 3.0615 1.5803 1.9793 1.9534 1.2902 1.2544 2.5015 3.8094 2.0388 1.4470 1.4464 1.5198 2.2185 1.3553 1.3923 1.4351 5.7741 5.4019 5.2754 1.3614 1.3177 2.7093 2.5585 2.1441 2.2985 1.3824 1.8183 1.6152 1.4194 1.6511 1.9443 2.4957 1.3425 1.2808 1.7540 1.0581 1.0726 1.7495 1.7201 1.1236 1.1422 1.7072 2.0655 2.7535 1.5389 2.6308 1.1644 2.2170 1.4353 1.2845 1.3889 1.4272 1.5654 4.4421 6.4409 5.9255 1.4056 1.2031 1.1884 2.5489 1.4107 2.3305 1.0553 2.2931 1.0507 1.0620 1.0744 1.1088 1.0826 1.0719 1.9421 2.1857 1.0842 1.2841 1.8500 7.1499 6.4411 5.8731 7.8596 6.0826 6.0708 6.4039 1.0675 1.0353 1.0613 1.0370 1.0382 1.0588 1.0917 1.1001 1.0991 1.0990 1.1053 1.0962 1.0846 1.0843 1.0971 1.0870 1.0876 1.0884 1.0925 1.0878 1.0925 1.0956 1.0959 1.1041 1.1034 1.1012 1.0966 1.0999 1.0961
irintensity: 1.0756 0.6404 5.6457 1.8321 1.3698 0.8175 0.2638 0.7166 0.2536 1.2667 0.2187 2.4333 0.6981 7.4670 1.6592 0.2561 0.8973 3.8305 4.0642 0.4388 2.9373 1.5672 1.7339 0.4319 0.8001 0.6626 17.8212 7.5885 0.7895 0.1038 0.0865 3.6894 0.3984 4.8915 4.3570 6.6967 12.5307 7.8738 11.1611 0.9145 11.6009 22.6818 7.0991 1.8399 2.5943 5.7133 5.7209 2.2830 58.0090 39.3639 1.5581 4.5367 25.2078 73.0355 12.9376 7.2595 23.1526 19.1045 4.2499 44.6886 12.0376 0.7545 0.8529 0.9870 3.8790 2.7717 4.7971 2.5550 2.0545 7.8822 0.5650 0.6889 1.3719 115.8345 0.1452 0.2499 0.3077 0.5228 11.1569 11.5958 9.7849 4.6255 5.2402 2.0950 0.6549 7.3384 15.8901 9.6590 1.5200 10.4497 8.1439 8.8892 0.0648 1.0581 74.4059 55.7193 0.9473 0.7403 5.9525 127.8608 194.6693 1.9225 27.0170 1.9123 3.2965 1.5017 6.6841 0.6372 2.5035 5.1210 19.2569 3.2952 0.6332 12.8539 13.7338 7.1168 5.5546 0.5289 1.7067 2.9783 12.7493 12.9082 4.6460 12.8642 7.0520 2.1868 42.5427 9.5368 10.9885 10.3205 106.1302 100.3212 11.3569 3.6427 2.6889 10.9785 17.3264 10.4682 99.1448 24.4343 37.7678 27.3193 21.2531 39.1704 31.2857 4.3445 44.5259 9.9725 47.2777 17.1165 4.8920 5.2547 2.0951 24.9462 0.4607 2.0613 6.4851 26.3260 17.2644 21.0735 38.4628 33.8540 7.6628 18.8151 31.9660 24.8142 5.9218 6.4373
temp: 298.150 k
press: 1.00000 atm
elementType: 8 8 7 6 6 6 6 6 6 6 6 6 6 6 6 6 6 6 6 6 6 6 6 6 6 6 6 6 6 1 1 1 1 1 1 1 1 1 1 1 1 1 1 1 1 1 1 1 1 1 1 1 1 1 1 1 1 1
symmnumber: 1
zpe: 1262811.2 jmol-1
zpe.correction: 0.480979 hartree
zpe.thermalcorrener: 0.508948 hartree
zpe.thermalcorrenthalpy: 0.509892 hartree
zpe.thermalcorrgfe: 0.419982 hartree
zpe.sumelectzpe: -1211.154350 hartree
zpe.sumelectthermal: -1211.126381 hartree
zpe.sumelectthermalent: -1211.125437 hartree
zpe.sumelectthermalfe: -1211.215347 hartree
dipole: 2.5585 -0.4170 -3.4655
dipole: 4.3277
quadrupole: -129.5981 -165.5286 -176.6020
quadrupole: 0.1983 -23.5427 6.7104
quadrupole: 27.6448 -8.2857 -19.3590 0.1983 -23.5427 6.7104
hfenergy: -1211.635329 hartree
pointgroup: C01 [X(C26H29N1O2)]
dipole: -1.0400917 -0.2244207 1.3292438 debye
polarizability: 449.4267629|-16.5686446|296.1322548|4.5353759|-5.4929226|217.4819409 unknown
InChI: InChI=1S/C26H29NO2/c1-4-25(21-11-7-5-8-12-21)26(22-13-9-6-10-14-22)23-15-17-24(18-16-23)29-20-19-27(2,3)28/h5-18H,4,19-20H2,1-3H3
charge 0 multiplicity 1
58 atoms
O  -4.107759 0.630316 0.625742
O  -7.063621 -0.667915 -1.947158
N  -7.485251 -0.486128 -0.588277
C  -6.412519 0.291421 0.19531
C  -5.015891 -0.210061 -0.176665
C  1.602426 -0.006438 0.262934
C  2.254055 -1.227004 0.348619
C  -7.730754 -1.850533 0.051667
C  -8.783569 0.312644 -0.572465
C  0.109507 0.11793 0.336999
C  1.539375 -2.519026 0.743974
C  2.33755 1.299568 0.140958
C  3.716031 -1.383098 0.05029
C  -2.728078 0.41226 0.474402
C  -0.493384 1.078028 1.20197
C  -0.753567 -0.666498 -0.472122
C  -1.888592 1.220685 1.281287
C  -2.158312 -0.531248 -0.414697
C  1.521523 -3.602846 -0.365685
C  3.455989 1.602986 0.96559
C  1.887848 2.294318 -0.771667
C  4.569968 -2.140949 0.899847
C  4.278503 -0.832821 -1.136413
C  4.115265 2.846376 0.865532
C  2.551911 3.535209 -0.880399
C  5.936781 -2.318056 0.592214
C  5.64101 -1.015991 -1.450964
C  3.671117 3.817665 -0.062569
C  6.481084 -1.756526 -0.586008
H  -6.599463 0.199954 1.281039
H  -6.501973 1.348348 -0.103285
H  -4.865072 -1.276476 0.08398
H  -4.861773 -0.074822 -1.260901
H  -8.464979 -2.36566 -0.583656
H  -8.097717 -1.756765 1.090419
H  -6.78313 -2.405991 0.020668
H  -9.536389 -0.285777 -1.105825
H  -9.114422 0.539054 0.45838
H  -8.590854 1.23509 -1.138421
H  2.058941 -2.947661 1.626193
H  0.509151 -2.2984 1.069129
H  0.147752 1.712892 1.823035
H  -0.31832 -1.381329 -1.17867
H  -2.349227 1.949505 1.955365
H  -2.784902 -1.144494 -1.068746
H  0.971193 -3.253432 -1.258481
H  1.030594 -4.524058 -0.001342
H  2.546274 -3.863293 -0.684836
H  3.801383 0.858375 1.690347
H  1.014222 2.08677 -1.400151
H  4.169585 -2.57996 1.821195
H  3.634677 -0.261519 -1.813355
H  4.973068 3.059316 1.513699
H  2.194759 4.281978 -1.598908
H  6.57598 -2.894198 1.271278
H  6.047336 -0.583357 -2.372361
H  4.184421 4.782784 -0.141465
H  7.540339 -1.89764 -0.82877
