program: Gaussian 09
title: 000063052
version: EM64L-G09RevD.01
frameworkgroup: C1[X(C21H28FNO4)]
method: RPBEPBE
basis: SDD
operation: Freq
keyword: #p
keyword: freq=noraman
keyword: PBEPBE/SDD
title: #p freq=noraman PBEPBE/SDD
converged: YES YES NO NO
title: Mulliken charges:
elementType: F O O O O N C C C C C C C C C C C C C C C C C C C C C H H H H H H H H H H H H H H H H H H H H H H H H H H H H
charge: -0.218978 -0.491210 -0.465951 -0.263326 -0.254967 -0.619493 0.378088 -0.105287 -0.259973 0.308650 0.049872 -0.600881 -0.647579 -0.118609 -0.232368 0.028685 -0.444818 -0.841999 -0.664893 0.637273 0.147062 -0.823196 -0.770632 -0.179529 -0.654692 -0.400365 0.190877 0.299558 0.254096 0.243125 0.216081 0.288185 0.223272 0.286489 0.247859 0.223673 0.238739 0.245673 0.227357 0.255983 0.219794 0.241979 0.209101 0.235332 0.250229 0.217760 0.285098 0.237670 0.360329 0.266309 0.354677 0.260316 0.250793 0.328020 0.350743
chargesum: 0.00000
title: Mulliken charges with hydrogens summed into heavy atoms:
elementType: F O O O O N C C C C C C C C C C C C C C C C C C C C C
charge: -0.218978 -0.130881 -0.111274 -0.263326 -0.254967 0.059270 0.378088 0.194270 -0.005878 0.308650 0.049872 -0.141675 -0.136122 0.167880 0.015490 0.028685 0.017594 -0.112985 -0.203120 0.637273 0.147062 -0.128534 -0.030105 0.086780 -0.394375 -0.149572 0.190877
polarizability: 3.01188251e+02 2.81442826e+00 2.18031452e+02 -2.72577071e+01 5.16866686e+00 1.95756770e+02
1716.lowfreq: -11.8570 -7.2618 -0.0009 -0.0002 0.0002 4.3067 29.6624 44.8660 60.2462
frequency: 29.6460 44.7523 60.2402 73.2193 80.9283 101.3700 119.4014 140.4702 156.8607 180.0268 188.9701 204.8232 208.9901 218.4443 229.0728 243.6731 246.3266 248.7420 262.6925 265.1793 279.1365 284.7905 301.7831 308.6420 312.8384 327.2351 335.6792 352.2554 360.8716 372.6663 388.5494 405.6827 420.0920 429.9939 450.6101 469.8431 476.1263 489.2686 506.1573 512.3020 522.7505 533.8730 563.3994 581.4585 592.0023 606.3964 638.0913 656.4030 671.3595 690.0813 693.6298 702.1179 709.2267 759.7524 790.8141 815.1871 830.9234 848.3455 862.6859 868.0479 878.5945 896.2085 905.6220 921.1839 930.1823 930.7777 950.7222 954.7865 958.2265 965.7485 993.4320 1004.5023 1007.3812 1027.4426 1029.8280 1043.2459 1052.9176 1061.5140 1065.1471 1086.0287 1098.8349 1101.6872 1109.9266 1117.0642 1136.8277 1140.7022 1146.0496 1156.4677 1162.1021 1177.5951 1188.0092 1205.1324 1214.3135 1229.1671 1244.0127 1253.3821 1261.6533 1276.3761 1283.7205 1291.8012 1299.2513 1310.0970 1312.9925 1325.1200 1331.3804 1342.3375 1345.9405 1346.6457 1349.6494 1353.4138 1369.6300 1375.9295 1383.7195 1388.8488 1391.3262 1404.0622 1461.3486 1462.6559 1465.7354 1466.4255 1470.5702 1476.7565 1487.7128 1492.6597 1494.9207 1496.9128 1552.0519 1556.2415 1618.9393 1627.7191 1667.3938 2957.8048 2958.5073 2967.2124 2975.9986 2981.8829 2989.8634 2996.4203 2996.8330 3000.1580 3005.0120 3023.1412 3044.6585 3045.8135 3056.1226 3060.6552 3062.8846 3073.0588 3082.0575 3091.9123 3107.0070 3111.3816 3129.7095 3131.8185 3150.1860 3495.9816 3558.8873 3569.3616 3661.8284
redmass: 6.9319 4.8046 5.8835 4.7440 3.2309 5.9413 3.5859 3.5463 3.8506 5.1902 2.6365 4.3813 3.3939 2.2741 2.4741 2.2631 2.2659 2.3200 2.1686 1.9213 1.3783 1.8827 1.6611 1.6520 2.6258 2.6284 3.7741 2.8226 3.6496 3.0417 3.9086 3.3528 4.7181 3.2028 3.0242 3.0827 4.0242 2.7654 3.4526 4.3153 3.7693 2.7102 2.7564 4.2692 1.7046 3.7947 3.7244 3.0384 4.1531 2.3299 1.9831 2.8261 2.1459 4.0542 3.4062 1.8877 1.6654 2.8530 2.9731 2.8981 2.6786 2.4865 1.8022 1.8919 1.8284 1.9927 2.2568 1.7443 2.5675 2.3306 2.2512 1.3156 2.6813 2.1352 2.8362 1.9789 3.2107 1.9221 2.1675 2.5014 2.3102 2.3666 2.1421 1.9150 2.1427 1.9181 2.3221 2.3567 1.8603 1.6628 2.0354 1.3536 1.5325 1.4931 1.5118 1.7632 1.4894 1.3428 1.6468 2.1906 1.3476 1.5544 1.6842 1.3219 1.6130 1.4192 1.8422 1.9040 1.3967 1.4649 1.4994 2.0748 1.4067 1.2139 1.4096 1.1974 1.0726 1.0796 1.0774 1.0763 1.0769 1.0480 1.0759 1.0562 1.0490 1.0561 1.3356 8.2444 8.5338 5.4836 7.4123 1.0399 1.0680 1.0651 1.0843 1.0780 1.0644 1.0482 1.0515 1.0436 1.0740 1.0855 1.0949 1.1004 1.0984 1.1028 1.0917 1.0962 1.0959 1.0995 1.0997 1.0866 1.0920 1.0986 1.0981 1.0442 1.0654 1.0659 1.1043
irintensity: 3.3577 3.3523 0.5913 3.6431 1.6558 5.9141 0.3865 0.5381 0.0417 3.9427 1.3510 3.7573 1.2304 1.0251 6.0852 12.0766 3.4299 8.1574 7.2043 48.0844 18.9175 82.2316 45.6836 44.9898 15.3232 14.1527 1.5187 2.0882 0.4165 0.9752 4.5973 0.2281 12.8228 2.5123 1.4935 1.3151 6.4046 8.1607 6.0539 5.3868 5.9383 22.5602 6.9530 7.7570 124.9468 14.8942 10.8165 1.7558 2.0765 57.8626 58.0964 6.7899 2.8737 1.4522 2.9439 4.1995 10.5987 36.9765 13.5980 16.1594 5.9685 5.9306 46.2851 2.9915 9.0040 5.4870 6.6649 14.5552 24.8942 42.7998 45.9572 0.7439 8.0909 13.2049 2.9420 9.6142 33.4843 7.9451 4.9871 6.4104 8.1439 11.0199 12.5589 10.9042 14.3601 12.1374 1.2170 1.0938 5.2657 12.9348 9.2609 1.6305 11.1821 9.8760 14.0658 45.4484 7.3694 21.7214 15.8237 17.7368 32.0285 35.3165 0.1616 1.6243 28.7692 1.6101 19.5789 6.1454 7.7192 23.9276 3.8045 21.0222 4.4808 15.6623 22.0731 27.7188 1.7851 15.7643 5.1512 15.1718 26.2791 10.2821 1.0113 4.2868 8.6992 7.9400 141.9926 180.5917 15.0441 237.9056 139.8971 30.3812 29.4053 20.8629 45.1398 4.3587 17.5806 23.2018 24.4007 12.2768 25.8429 5.7523 26.3111 23.0340 32.8239 22.2212 13.0209 21.3326 22.2759 32.9160 16.7801 4.3994 9.9382 3.1882 13.8653 35.6369 14.5481 6.0984 53.2316
temp: 298.150 k
press: 1.00000 atm
elementType: 9 8 8 8 8 7 6 6 6 6 6 6 6 6 6 6 6 6 6 6 6 6 6 6 6 6 6 1 1 1 1 1 1 1 1 1 1 1 1 1 1 1 1 1 1 1 1 1 1 1 1 1 1 1 1
symmnumber: 1
zpe: 1197448.5 jmol-1
zpe.correction: 0.456084 hartree
zpe.thermalcorrener: 0.481826 hartree
zpe.thermalcorrenthalpy: 0.482770 hartree
zpe.thermalcorrgfe: 0.403683 hartree
zpe.sumelectzpe: -1270.471293 hartree
zpe.sumelectthermal: -1270.445551 hartree
zpe.sumelectthermalent: -1270.444607 hartree
zpe.sumelectthermalfe: -1270.523695 hartree
dipole: -6.5400 -0.2666 0.9055
dipole: 6.6078
quadrupole: -207.7188 -139.6551 -164.2458
quadrupole: -0.3248 33.6841 5.7732
quadrupole: -37.1789 30.8848 6.2941 -0.3248 33.6841 5.7732
hfenergy: -1270.9273771 hartree
pointgroup: C01 [X(C21H28F1N1O4)]
dipole: -2.5727113 0.1428857 -0.3451966 debye
polarizability: 301.3246518|-3.9820346|218.158566|26.8742728|4.7192244|195.4932551 unknown
InChI: InChI=1S/C21H28FNO4/c1-11-8-15-14-5-4-12-9-13(24)6-7-18(12,2)20(14,22)16(25)10-19(15,3)21(11,27)17(23)26/h6-7,9,11,14-16,25,27H,4-5,8,10,23H2,1-3H3
charge 0 multiplicity 1
55 atoms
F  1.256524 -0.060383 1.348179
O  -3.03328 0.020848 1.897186
O  0.465864 2.426111 -1.223428
O  -5.143678 1.009723 -0.901422
O  6.167346 -0.103557 1.587073
N  -4.633173 1.986953 1.150931
C  -1.916414 0.486087 -0.239229
C  -1.143607 -0.862345 -0.105994
C  0.265357 -0.826134 -0.731824
C  1.090851 0.325736 -0.090627
C  -3.282697 0.06049 0.433587
C  -2.153799 -1.926562 -0.598489
C  -1.119798 1.558818 0.533476
C  -3.557604 -1.364922 -0.170427
C  0.349414 1.692315 0.057052
C  2.573536 0.398459 -0.649599
C  0.988187 -2.183983 -0.534137
C  -2.163661 0.907967 -1.712836
C  2.478554 -2.162714 -0.966911
C  3.211651 -0.970631 -0.385643
C  -4.44727 1.047525 0.157918
C  -4.336619 -2.306501 0.77181
C  2.615709 0.671718 -2.198425
C  3.33167 1.541776 0.000677
C  4.37071 -1.101828 0.327077
C  4.487641 1.384277 0.701916
C  5.086497 0.045209 0.923707
H  -1.002869 -1.02043 0.982202
H  0.179386 -0.611745 -1.815179
H  -2.10063 -2.052356 -1.696958
H  -1.963369 -2.916814 -0.146525
H  -1.106555 1.284417 1.602924
H  -1.602135 2.557162 0.459468
H  -4.186195 -1.191154 -1.062278
H  0.90121 2.258916 0.835173
H  0.450815 -2.965511 -1.102808
H  0.930499 -2.45327 0.537083
H  -2.799298 0.188733 -2.254289
H  -2.687374 1.880294 -1.756034
H  -1.209766 1.016314 -2.252536
H  2.529952 -2.129013 -2.074869
H  2.973732 -3.099815 -0.655154
H  -3.736048 -2.610135 1.653518
H  -5.289622 -1.85903 1.11525
H  -4.59435 -3.238903 0.2392
H  2.066483 -0.095182 -2.769803
H  2.172457 1.65205 -2.424643
H  3.669133 0.656058 -2.528237
H  -3.605988 -0.681659 2.296648
H  2.92496 2.543804 -0.189425
H  -0.222336 3.137641 -1.2342
H  4.820787 -2.088134 0.495628
H  5.031073 2.237602 1.124071
H  -5.369216 2.684057 1.048121
H  -4.084047 1.90795 2.008552
